program: Gaussian 09
title: 000248696
version: EM64L-G09RevD.01
frameworkgroup: C1[X(C15H11N3)]
method: RPBEPBE
basis: SDD
operation: Freq
keyword: #pfreq=noraman
keyword: PBEPBE/SDD
title: #p freq=noraman PBEPBE/SDD
converged: YES YES NO NO
title: Mulliken charges:
elementType: N N N C C C C C C C C C C C C C C C H H H H H H H H H H H
charge: -0.088016 -0.051664 -0.066470 0.289517 0.337780 -0.062813 -0.368035 -0.275979 -0.304267 -0.462353 -0.243777 -0.219507 -0.307860 0.196582 -0.312922 -0.193637 -0.175076 -0.369791 0.240165 0.267219 0.264678 0.247856 0.233432 0.236263 0.231080 0.236475 0.242697 0.235190 0.243233
chargesum: 0.00000
title: Mulliken charges with hydrogens summed into heavy atoms:
elementType: N N N C C C C C C C C C C C C C C C
charge: -0.088016 -0.051664 -0.066470 0.289517 0.337780 -0.062813 -0.127871 -0.008760 -0.039589 -0.214496 -0.010345 0.016757 -0.076780 0.196582 -0.076448 0.049061 0.060114 -0.126558
polarizability: 3.81388220e+02 -6.31533562e+00 2.02235196e+02 2.10342190e+00 -3.90063428e+00 7.26431002e+01
1716.lowfreq: -4.6464 -0.0006 -0.0005 0.0008 3.7942 8.2139 24.6800 48.8066 57.3008
frequency: 24.4124 48.7769 57.2825 97.8456 147.4874 163.1262 187.5693 216.9865 227.3820 271.0331 386.6231 403.2217 421.1040 462.6049 475.2424 493.4566 498.9880 539.4910 567.1809 570.8797 616.3718 650.4321 653.1343 734.6935 743.1515 772.2832 778.3465 798.9621 802.1771 859.5665 870.9869 880.5883 882.5096 899.6003 908.5256 961.4980 963.3209 971.7427 984.5188 1000.7023 1003.1877 1017.3871 1035.1403 1040.3809 1078.2512 1092.1357 1116.6037 1158.3349 1166.6486 1185.5032 1205.7031 1235.3972 1254.9876 1269.4054 1297.9136 1312.7966 1316.5022 1333.2837 1386.7656 1400.2467 1415.1491 1440.6465 1454.1961 1490.6082 1500.3188 1552.7552 1555.3806 1574.8110 1619.3140 1636.9675 3114.2349 3126.7648 3130.8142 3135.9595 3136.7230 3149.9018 3153.3080 3157.4400 3163.6873 3173.7859 3175.1493
redmass: 4.1833 5.1184 5.2578 4.6469 3.7633 4.2700 6.2147 6.1293 2.6233 5.0285 5.0815 3.2959 3.2812 3.7216 5.2383 5.1591 3.8173 6.1679 5.6850 5.6747 7.1383 4.8505 4.4539 5.6255 1.7670 1.3829 2.2320 2.6712 5.8783 4.3819 5.2634 1.5517 1.5878 1.5189 1.7686 1.4836 6.4660 1.3506 1.1589 1.3340 1.3318 2.8802 2.8618 2.5773 3.8613 1.6948 2.4847 2.0571 1.0776 1.2606 1.5458 2.7446 2.0394 2.3794 2.3476 1.7635 1.4272 2.4714 2.5177 2.9063 2.0354 3.3083 2.3845 3.2450 5.3666 6.3968 5.5209 5.7074 6.2127 5.7156 1.0923 1.0889 1.0873 1.0880 1.0871 1.0890 1.0942 1.0913 1.0953 1.1012 1.1000
irintensity: 2.2409 0.1003 1.4453 1.8322 1.2837 4.8899 0.6060 1.3964 1.9176 1.1329 5.4525 3.2894 3.0279 0.9008 2.1445 3.9079 9.5464 0.1526 17.4261 8.1847 0.1731 1.4724 2.8704 1.7628 28.1016 125.8407 5.9588 1.0688 2.0330 1.2214 0.3615 8.5550 4.4040 9.8140 1.2473 1.7295 1.2424 1.1029 52.3564 4.0011 0.5379 4.0573 8.6417 0.0850 2.9320 5.2708 6.6161 14.4317 4.6541 10.6434 2.1816 1.6622 0.5708 0.7518 5.6985 3.9786 3.1786 7.9738 2.9411 16.8963 32.7914 16.0509 60.4810 50.9045 1.8201 26.4193 5.5299 80.7941 4.2559 5.4613 7.9439 23.8865 2.8784 3.7259 0.4729 10.6479 20.1903 10.6000 15.3691 30.3784 23.4445
temp: 298.150 k
press: 1.00000 atm
elementType: 7 7 7 6 6 6 6 6 6 6 6 6 6 6 6 6 6 6 1 1 1 1 1 1 1 1 1 1 1
symmnumber: 1
zpe: 578743.1 jmol-1
zpe.correction: 0.220432 hartree
zpe.thermalcorrener: 0.234249 hartree
zpe.thermalcorrenthalpy: 0.235193 hartree
zpe.thermalcorrgfe: 0.178073 hartree
zpe.sumelectzpe: -741.184111 hartree
zpe.sumelectthermal: -741.170294 hartree
zpe.sumelectthermalent: -741.169350 hartree
zpe.sumelectthermalfe: -741.226470 hartree
dipole: 5.0542 3.4148 0.5621
dipole: 6.1255
quadrupole: -83.7223 -103.2392 -109.4586
quadrupole: -20.8826 0.3170 -1.6860
quadrupole: 15.0844 -4.4325 -10.6519 -20.8826 0.3170 -1.6860
hfenergy: -741.4045425 hartree
pointgroup: C01 [X(C15H11N3)]
dipole: 2.0496072 -1.2306383 0.3041218 debye
polarizability: 380.4290871|13.1817663|179.566565|-6.3087869|-50.4305178|96.2708644 unknown
InChI: InChI=1S/C15H11N3/c1-2-7-15-14(6-1)12(11-17-18-15)8-9-13-5-3-4-10-16-13/h1-11H
charge 0 multiplicity 1
29 atoms
N  -3.614537 1.429477 -0.687135
N  -2.568068 2.248503 -0.943712
N  3.135173 -0.810144 0.510403
C  -2.025461 -0.37343 0.043577
C  -0.92256 0.515079 -0.252239
C  -3.357367 0.146084 -0.186428
C  -1.892473 -1.715518 0.528385
C  0.470922 0.111502 -0.045662
C  -4.504651 -0.666956 0.084809
C  -1.27685 1.8011 -0.718491
C  -3.026478 -2.489897 0.785433
C  -4.341954 -1.965329 0.566114
C  1.574987 0.733611 -0.567066
C  2.952019 0.290312 -0.301491
C  4.053864 0.988184 -0.871882
C  5.367662 0.551193 -0.601756
C  5.555084 -0.574798 0.23158
C  4.406349 -1.216877 0.759409
H  -0.899215 -2.143497 0.693879
H  0.673655 -0.766082 0.580013
H  -5.489193 -0.228191 -0.104244
H  -0.517902 2.562158 -0.92169
H  -2.911657 -3.513973 1.157323
H  -5.215751 -2.591611 0.774633
H  1.472655 1.599857 -1.233891
H  3.873514 1.857593 -1.513602
H  6.22645 1.076982 -1.031821
H  6.555164 -0.950148 0.468565
H  4.50822 -2.094781 1.408388
