program: Gaussian 09
title: 000248678
version: EM64L-G09RevD.01
frameworkgroup: C1[X(C12H10Cl2N2S)]
method: RPBEPBE
basis: SDD
operation: Freq
keyword: #p
keyword: freq=noraman
keyword: PBEPBE/SDD
title: #p freq=noraman PBEPBE/SDD
converged: YES YES NO NO
title: Mulliken charges:
elementType: Cl Cl S N N C C C C C C C C C C C C H H H H H H H H H H
charge: -0.050886 -0.047046 0.231089 -0.095887 -0.112863 0.642595 -0.866132 -0.282138 -0.340914 -0.210614 -0.231625 -0.242577 -0.091731 -0.136798 0.162860 -0.248090 -0.762614 0.296046 0.315890 0.295869 0.281295 0.260819 0.257654 0.249519 0.232898 0.260680 0.232699
chargesum: 0.00000
title: Mulliken charges with hydrogens summed into heavy atoms:
elementType: Cl Cl S N N C C C C C C C C C C C C
charge: -0.050886 -0.047046 0.231089 -0.095887 -0.112863 0.642595 -0.254196 -0.282138 -0.045045 0.070681 0.029193 -0.242577 -0.091731 0.120857 0.162860 0.001429 -0.036338
polarizability: 2.46183454e+02 -1.40573193e+01 1.99237420e+02 1.54225980e-01 -1.05735376e+01 1.07935571e+02
1716.lowfreq: -8.1630 -5.5481 0.0013 0.0027 0.0030 3.9044 18.2627 31.1830 43.8812
frequency: 18.1633 31.1594 43.8457 71.8835 89.0685 101.2745 111.8258 153.6929 167.2125 188.7432 246.6289 286.6740 297.7271 330.0484 362.7748 368.5290 388.2527 391.4686 407.6910 431.2797 450.6557 478.8389 539.0225 607.8973 621.0809 636.7837 640.5613 688.9014 731.9353 738.5116 794.7071 818.4845 828.0398 839.9709 861.2117 878.6374 969.4264 972.4628 978.6923 992.6445 1024.7174 1040.1953 1048.2737 1080.5403 1130.4161 1133.6183 1146.7766 1182.3185 1217.9493 1238.5116 1252.8040 1270.5213 1300.2973 1367.0671 1367.5392 1379.4899 1397.2093 1431.3680 1457.8413 1459.5778 1468.5797 1507.5895 1564.6091 1566.4719 1591.8340 2985.6018 3056.2129 3064.6800 3116.4176 3136.2930 3142.9244 3152.5633 3165.9680 3177.0702 3185.8549
redmass: 6.9761 7.9895 5.0634 5.7107 1.5291 6.6692 2.6139 7.6306 6.4387 14.8988 4.8150 3.7495 3.9183 4.1163 6.6258 8.0469 5.5025 6.4599 4.4700 3.3001 3.8640 3.4847 6.0864 5.0049 5.6549 7.7689 7.6653 7.4182 4.1891 5.3907 6.8090 4.0003 1.3899 1.5454 1.4057 1.7493 1.7126 1.3591 1.3200 3.8647 4.0130 4.2129 1.5422 2.4963 5.3204 1.5850 1.3750 1.0880 2.6962 2.4531 1.1638 1.3517 3.5078 3.0261 3.6456 4.7980 1.2726 1.1694 1.1922 2.3692 1.0457 3.3815 6.2087 7.7194 7.3233 1.0379 1.0579 1.0977 1.0982 1.1077 1.0891 1.0904 1.0995 1.0963 1.0937
irintensity: 0.5484 1.3503 4.1150 5.2421 0.2550 1.3122 2.0429 1.9632 0.0862 1.5109 2.5409 0.5734 1.6950 7.2189 3.6377 12.5328 0.1743 7.0680 4.7290 3.4080 10.3189 0.7380 5.3315 16.8615 25.6992 6.7790 1.5985 28.7086 7.7799 0.0194 5.8026 60.8433 18.0437 42.3922 20.7511 12.3429 14.8695 2.2197 0.0651 1.4177 46.0435 14.8482 8.6707 30.4370 51.9185 29.0794 12.9521 2.3014 7.5424 3.3196 7.6454 3.8659 3.0676 61.7834 59.1893 11.8222 29.2121 28.8374 34.6983 78.0600 16.5960 17.0153 14.2904 35.6240 51.5683 24.3780 8.5403 16.4892 6.3718 1.9895 6.4470 2.7186 7.9919 2.1870 0.4807
temp: 298.150 k
press: 1.00000 atm
elementType: 17 17 16 7 7 6 6 6 6 6 6 6 6 6 6 6 6 1 1 1 1 1 1 1 1 1 1
symmnumber: 1
zpe: 498640.1 jmol-1
zpe.correction: 0.189922 hartree
zpe.thermalcorrener: 0.206362 hartree
zpe.thermalcorrenthalpy: 0.207307 hartree
zpe.thermalcorrgfe: 0.142883 hartree
zpe.sumelectzpe: -1889.716893 hartree
zpe.sumelectthermal: -1889.700453 hartree
zpe.sumelectthermalent: -1889.699508 hartree
zpe.sumelectthermalfe: -1889.763932 hartree
dipole: 4.1497 -0.0290 -1.3601
dipole: 4.3670
quadrupole: -103.5134 -121.6692 -119.9606
quadrupole: -4.1447 -10.3302 1.0822
quadrupole: 11.5344 -6.6215 -4.9129 -4.1447 -10.3302 1.0822
hfenergy: -1889.906815 hartree
pointgroup: C01 [X(C12H10Cl2N2S1)]
dipole: -1.6504594 -0.1150618 0.4633596 debye
polarizability: 246.8495648|9.5795029|181.8494422|9.2031288|36.5681577|124.6574379 unknown
InChI: InChI=1S/C12H10Cl2N2S/c1-8-2-5-12(16-15-8)17-7-9-3-4-10(13)6-11(9)14/h2-6H,7H2,1H3
charge 0 multiplicity 1
27 atoms
Cl 3.123986 2.478452 1.225194
Cl 4.597226 -2.714103 -0.02366
S  -0.666417 2.021874 1.050549
N  -1.921697 0.262276 -0.663375
N  -2.930747 -0.589114 -1.0680
C  1.516163 0.76369 -0.321961
C  0.517722 1.881631 -0.454187
C  2.734413 0.899305 0.389044
C  1.269646 -0.492101 -0.94223
C  3.682109 -0.13623 0.49566
C  2.193235 -1.55509 -0.860205
C  -2.000123 0.88672 0.546811
C  3.38764 -1.35692 -0.141267
C  -3.094697 0.69804 1.439273
C  -4.00905 -0.801176 -0.245744
C  -4.115427 -0.162891 1.027205
C  -5.064528 -1.746646 -0.767944
H  0.993491 2.873437 -0.480078
H  -0.136839 1.733904 -1.325222
H  0.321693 -0.622332 -1.47429
H  4.611689 0.004887 1.05146
H  1.987372 -2.513492 -1.34416
H  -3.127825 1.211147 2.404935
H  -4.984449 -0.34954 1.666152
H  -6.045295 -1.243565 -0.856508
H  -4.766879 -2.115804 -1.761718
H  -5.196413 -2.612459 -0.092835
