program: Gaussian 09
title: 000248652
version: EM64L-G09RevD.01
frameworkgroup: C1[X(C3H4Cl3NO)]
method: RPBEPBE
basis: SDD
operation: Freq
keyword: #p
keyword: freq=noraman
keyword: PBEPBE/SDD
title: #p freq=noraman PBEPBE/SDD
converged: YES YES NO NO
title: Mulliken charges:
elementType: Cl Cl Cl O N C C C H H H H
charge: 0.048811 0.143121 0.119327 -0.213266 -0.352768 0.439898 -0.674811 -0.595995 0.328279 0.278122 0.239623 0.239658
chargesum: 0.00000
title: Mulliken charges with hydrogens summed into heavy atoms:
elementType: Cl Cl Cl O N C C C
charge: 0.048811 0.143121 0.119327 -0.213266 -0.024489 0.439898 -0.674811 0.161409
polarizability: 7.80391832e+01 5.90351910e+00 7.68847018e+01 1.11751058e+00 6.30760472e-02 6.32760786e+01
1716.lowfreq: -12.9838 -10.9691 0.0004 0.0005 0.0020 4.7715 12.1885 74.3320 131.1463
frequency: -6.3049 74.3245 131.1457 169.3215 208.7624 223.5268 261.0227 273.7710 299.9356 368.6865 378.8516 621.3263 639.2280 692.6928 726.3998 762.4913 882.8529 1059.6385 1119.1143 1147.3134 1219.3334 1424.6198 1455.5473 1484.6418 1514.9209 1646.4489 2991.0190 3075.5438 3121.7202 3527.5041
redmass: 6.7991 1.0442 4.7459 8.0122 7.8636 8.4753 14.2090 12.9228 6.5867 18.7719 8.7151 12.7905 1.1384 6.2805 8.8004 11.7064 4.2616 6.9407 1.2979 1.6275 2.4121 1.1672 1.2045 1.0448 1.4313 9.5531 1.0346 1.1027 1.0996 1.0779
irintensity: 5.7613 0.1238 0.3051 1.6917 0.8669 0.9708 1.3637 1.6004 9.3366 12.6363 18.7682 138.8467 92.6787 78.2881 104.4753 89.3593 16.0048 0.6637 0.3859 54.1419 26.9652 23.1937 68.4056 19.2483 104.3979 171.2150 43.6598 25.4164 1.6129 48.3561
temp: 298.150 k
press: 1.00000 atm
elementType: 17 17 17 8 7 6 6 6 1 1 1 1
symmnumber: 1
zpe: 188422.0 jmol-1
zpe.correction: 0.071766 hartree
zpe.thermalcorrener: 0.080527 hartree
zpe.thermalcorrenthalpy: 0.081471 hartree
zpe.thermalcorrgfe: 0.036896 hartree
zpe.sumelectzpe: -1626.237580 hartree
zpe.sumelectthermal: -1626.228819 hartree
zpe.sumelectthermalent: -1626.227875 hartree
zpe.sumelectthermalfe: -1626.272450 hartree
dipole: 2.9522 3.0575 -0.0066
dipole: 4.2501
quadrupole: -58.3015 -71.7714 -67.2632
quadrupole: 5.5639 0.1714 -0.1156
quadrupole: 7.4772 -5.9927 -1.4845 5.5639 0.1714 -0.1156
hfenergy: -1626.3093466 hartree
pointgroup: C01 [X(C3H4Cl3N1O1)]
dipole: 1.1401807 1.1567292 -0.3974748 debye
dipolederiv: -0.2858293 0.04816 -0.0251228 0.1120908 -0.7414698 0.3163968 -0.0680029 0.3094452 -0.3399246 -0.3181687 -0.2374001 -0.1890839 -0.2418232 -0.3927097 -0.2283068 -0.1524826 -0.2179825 -0.2786608 -0.2505475 0.0329997 0.1947718 0.0160495 -0.1335448 -0.0873957 0.1960711 -0.0889383 -0.7223447 -0.6149077 0.2117594 -0.0501442 -0.1256527 -0.8694833 0.1565907 0.065285 0.1703965 -0.3453148 -0.94857 -0.285581 0.1031006 -0.178861 -0.5804001 0.0530094 0.0480556 0.0248489 -0.4498319 1.1146704 0.0273516 -0.0643501 0.3421246 1.0049593 -0.2726842 -0.2071938 -0.2725359 0.1226992 0.5513442 0.244156 0.0164608 0.2011312 1.3056967 -0.0040523 0.0542861 -0.0023306 1.4256173 0.4505039 0.0676874 -0.0274231 -0.1471039 0.0275651 0.0790366 0.0512854 0.0826629 0.2370987 0.252232 0.0168509 -0.0034276 0.0042081 0.2114498 0.0353158 0.0131062 0.0436761 0.3102992 0.1393746 -0.0475723 0.0159645 0.0838516 0.0044456 0.043964 -0.0252539 0.0430268 0.1183154 -0.04246 -0.053785 -0.0274524 -0.0693417 0.0303908 -0.119481 -0.0890589 -0.1099472 0.015224 -0.0476419 -0.0246265 0.0567063 0.0033267 0.1331003 0.0276068 0.1139027 0.0176782 -0.0931771 unknown
polarizability: 77.861807|5.9103244|75.7561107|-0.9737136|-4.0860888|64.5820459 unknown
InChI: InChI=1S/C3H4Cl3NO/c1-7-2(8)3(4,5)6/h7H,1H3
charge 0 multiplicity 1
12 atoms
Cl -1.189533 1.792474 -0.845322
Cl -2.007346 -1.122922 -0.813201
Cl -1.596929 0.35492 1.800834
O  0.740767 -1.544635 0.485531
N  1.458984 0.583771 -0.160631
C  0.507979 -0.357721 0.13134
C  -0.97807 0.133498 0.057749
C  2.893164 0.276451 -0.070684
H  1.160464 1.513506 -0.465249
H  2.99978 -0.761811 0.2798
H  3.392515 0.953351 0.64527
H  3.377825 0.373916 -1.058736
