program: Gaussian 09
title: 000248620
version: EM64L-G09RevD.01
frameworkgroup: C1[X(C15H9Cl2NO3)]
method: RPBEPBE
basis: SDD
operation: Freq
keyword: #p
keyword: freq=noraman
keyword: PBEPBE/SDD
title: #p freq=noraman PBEPBE/SDD
converged: YES YES NO NO
title: Mulliken charges:
elementType: Cl Cl O O O N C C C C C C C C C C C C C C C H H H H H H H H H
charge: 0.062842 0.062729 -0.246873 -0.192742 -0.188929 -0.458137 0.281305 0.330529 0.198176 0.063014 -0.354270 -0.498362 0.546466 -0.369444 -0.521719 0.062039 -0.347595 -0.229804 -0.235645 0.374467 -0.744503 0.228489 0.341096 0.226885 0.226344 0.278496 0.235262 0.241740 0.313292 0.314853
chargesum: 0.00000
title: Mulliken charges with hydrogens summed into heavy atoms:
elementType: Cl Cl O O O N C C C C C C C C C C C C C C C
charge: 0.062842 0.062729 -0.246873 -0.192742 -0.188929 -0.144845 0.281305 0.330529 0.198176 0.063014 -0.125782 -0.157265 0.546466 -0.142560 -0.295375 0.062039 -0.069099 0.005457 0.006094 0.374467 -0.429650
polarizability: 3.81182289e+02 3.12329488e+00 1.97508762e+02 -1.95905860e-02 2.26705013e-02 1.03743883e+02
1716.lowfreq: -16.1005 -9.5697 -3.1010 0.0023 0.0031 0.0032 1.3975 24.7667 35.0631
frequency: -15.1194 24.6304 35.0232 65.0086 84.8396 95.4967 132.3089 151.6693 180.6632 190.5250 220.5036 240.3930 268.1409 297.5064 304.4160 349.6047 365.9161 405.7442 425.5515 428.3087 450.6795 484.0012 524.2314 567.4695 601.5278 607.3007 622.8268 643.2739 644.4132 663.1024 681.0673 705.6123 715.6328 728.3217 753.9279 770.6093 773.5734 785.8803 816.1607 816.3781 889.9531 926.4632 936.1976 940.1287 941.7896 979.4371 985.7432 995.2783 1006.4085 1049.0462 1091.1998 1117.2839 1145.8458 1171.4409 1180.4378 1181.6477 1211.6851 1242.5064 1262.6787 1276.6221 1277.5674 1322.8322 1377.8340 1392.3962 1425.7596 1445.5785 1465.8649 1502.7990 1517.0750 1567.7292 1591.2266 1615.1370 1627.2464 1640.1738 1672.9659 3097.1859 3124.9396 3136.5265 3150.7117 3160.3403 3166.1072 3175.0404 3203.6581 3523.1039
redmass: 15.1796 13.6241 7.7110 10.4586 6.0642 5.3755 5.6123 12.9884 9.5321 7.7371 6.2835 10.8200 6.4230 16.1146 8.9500 4.4077 7.3990 7.8070 3.6019 7.4694 3.0427 9.1290 3.7426 8.1431 7.2380 6.8045 1.7924 7.3955 2.0709 4.3067 6.8640 7.8029 7.0313 3.0769 9.9303 3.2607 6.4417 1.5155 7.6275 1.7038 1.4900 1.4300 7.3819 5.8007 1.3776 1.3804 4.0441 7.0041 1.3461 2.0603 2.6689 1.9153 1.8088 1.6786 1.0853 1.0641 2.2282 1.9673 1.7851 1.7954 1.5726 2.3284 3.7920 8.9472 5.5573 2.8126 2.3216 2.2124 3.6118 5.2218 6.3982 6.3307 6.5196 6.6641 11.9950 1.0892 1.0892 1.0861 1.0898 1.0953 1.0934 1.1004 1.0935 1.0767
irintensity: 0.1085 0.2205 0.0630 0.5283 0.0434 4.8814 0.2437 1.4068 1.4090 0.7606 0.0863 0.0435 0.0058 0.9677 11.7485 0.0502 1.0762 2.1759 0.3122 1.9305 10.6017 0.2314 6.7600 17.6775 2.2963 95.9609 4.0664 14.6003 56.6638 17.9406 21.0240 25.1919 3.9035 20.0044 40.5932 27.6967 18.8924 62.6847 11.9602 36.9099 0.1349 42.2355 28.3961 41.3991 0.0779 1.8865 145.7368 26.6215 0.2237 2.5489 36.9145 60.0447 71.3153 67.8231 4.2410 9.5756 3.6848 38.0206 19.2602 9.3949 0.6314 33.5504 74.5053 28.2798 41.6348 93.7678 19.4932 350.2145 5.8598 75.4077 52.4379 52.0658 187.7371 133.9737 335.8226 10.9953 15.6126 3.5248 5.9749 2.2957 16.8729 24.8431 15.8037 17.6723
temp: 298.150 k
press: 1.00000 atm
elementType: 17 17 8 8 8 7 6 6 6 6 6 6 6 6 6 6 6 6 6 6 6 1 1 1 1 1 1 1 1 1
symmnumber: 1
zpe: 540316.3 jmol-1
zpe.correction: 0.205796 hartree
zpe.thermalcorrener: 0.222463 hartree
zpe.thermalcorrenthalpy: 0.223407 hartree
zpe.thermalcorrgfe: 0.159601 hartree
zpe.sumelectzpe: -1776.115473 hartree
zpe.sumelectthermal: -1776.098806 hartree
zpe.sumelectthermalent: -1776.097862 hartree
zpe.sumelectthermalfe: -1776.161668 hartree
dipole: -2.3136 -9.5937 -0.0109
dipole: 9.8687
quadrupole: -123.0525 -135.8133 -138.3818
quadrupole: 1.2242 -0.0250 0.0134
quadrupole: 9.3633 -3.3974 -5.9659 1.2242 -0.0250 0.0134
hfenergy: -1776.3212691 hartree
pointgroup: C01 [X(C15H9Cl2N1O3)]
dipole: 0.9056408 -3.7755558 0.0011732 debye
polarizability: 381.1743818|-3.3477489|197.5166432|-0.008466|0.0557785|103.7439096 unknown
InChI: InChI=1S/C15H9Cl2NO3/c16-13(17)14(19)18-8-5-6-10-9-3-1-2-4-11(9)15(20)21-12(10)7-8/h1-7,13,18H
charge 0 multiplicity 1
30 atoms
Cl -6.365485 0.202332 1.531444
Cl -6.362835 0.195938 -1.53447
O  0.998582 1.732662 0.000205
O  2.850748 3.077612 0.000598
O  -3.765236 1.381046 0.000164
N  -3.102644 -0.878764 0.000677
C  1.178421 -0.733221 -0.000047
C  2.643081 -0.627419 -0.000199
C  0.402477 0.459693 0.000183
C  3.240338 0.673586 -0.000129
C  0.458925 -1.960486 -0.000019
C  -1.005788 0.46716 0.000394
C  -1.684038 -0.771451 0.000412
C  3.505877 -1.759211 -0.000343
C  -0.940172 -1.98863 0.000208
C  2.423952 1.908782 -0.000118
C  4.651991 0.824177 -0.000116
C  4.902697 -1.601955 -0.000372
C  5.484556 -0.306878 -0.000248
C  -4.038858 0.155258 0.000562
C  -5.484426 -0.379942 0.000515
H  1.001665 -2.910094 -0.000164
H  -1.545648 1.414731 0.000539
H  3.086247 -2.769671 -0.000412
H  -1.464409 -2.952036 0.00022
H  5.062981 1.838626 -0.000049
H  5.546896 -2.488004 -0.000477
H  6.573084 -0.192146 -0.000267
H  -3.463182 -1.83623 0.000809
H  -5.568699 -1.475664 0.002702
