program: Gaussian 09
title: 000020138
version: EM64L-G09RevD.01
frameworkgroup: C1[X(C4H6O)]
method: RPBEPBE
basis: SDD
operation: Freq
keyword: #p
keyword: freq=noraman
keyword: PBEPBE/SDD
title: #p freq=noraman PBEPBE/SDD
converged: NO NO NO NO
title: Mulliken charges:
elementType: O C C C C H H H H H H
charge: -0.208381 -0.097414 -0.722883 -0.219473 -0.095240 0.217661 0.237109 0.237122 0.235811 0.261735 0.153952
chargesum: 0.00000
title: Mulliken charges with hydrogens summed into heavy atoms:
elementType: O C C C C
charge: -0.208381 0.120248 -0.012841 0.042262 0.058712
polarizability: 7.96734117e+01 6.32310080e+00 4.09067192e+01 -2.02973717e-04 1.55126652e-03 2.52579009e+01
1716.lowfreq: -3.8734 0.0005 0.0008 0.0008 6.3695 48.5032 130.2098 191.5638 199.3376
frequency: 130.1073 191.5553 199.3353 294.4467 450.0360 520.9232 790.6582 930.5852 976.8940 1000.6495 1046.7964 1093.1362 1153.5694 1252.9737 1291.3633 1383.4620 1391.0342 1457.2694 1461.4442 1611.5604 1657.3801 2845.1769 2969.1543 3042.9145 3067.8961 3097.0162 3127.9509
redmass: 2.4469 1.3892 3.5226 2.1997 3.3906 4.3765 1.2614 1.4819 1.6478 1.1441 1.6165 3.7521 2.2626 1.4234 1.2889 1.2257 1.2299 1.0475 1.0736 7.6094 5.1922 1.0846 1.0372 1.0958 1.0903 1.0990 1.0928
irintensity: 1.0216 0.7203 5.9098 11.4646 2.8035 9.6136 0.3442 34.6223 10.6021 54.4515 0.0055 11.0504 47.6042 1.0431 4.1309 4.6857 28.2421 18.5822 26.6513 143.5635 149.3844 117.2983 11.8660 16.6284 6.1933 32.0916 11.0185
temp: 298.150 k
press: 1.00000 atm
elementType: 8 6 6 6 6 1 1 1 1 1 1
symmnumber: 1
zpe: 229894.1 jmol-1
zpe.correction: 0.087562 hartree
zpe.thermalcorrener: 0.093450 hartree
zpe.thermalcorrenthalpy: 0.094394 hartree
zpe.thermalcorrgfe: 0.058786 hartree
zpe.sumelectzpe: -230.827548 hartree
zpe.sumelectthermal: -230.821660 hartree
zpe.sumelectthermalent: -230.820716 hartree
zpe.sumelectthermalfe: -230.856324 hartree
dipole: 4.5005 1.1172 -0.0007
dipole: 4.6371
quadrupole: -37.0352 -27.7120 -31.2423
quadrupole: -1.9394 0.0036 0.0017
quadrupole: -5.0387 4.2845 0.7542 -1.9394 0.0036 0.0017
hfenergy: -230.9151101 hartree
pointgroup: C01 [X(C4H6O1)]
dipole: 1.776937 -0.4133141 0.000839 debye
dipolederiv: -1.0993659 0.0909514 0.0002784 0.2085942 -0.4784011 -0.0001306 -0.0008765 0.0002785 -0.3546014 0.6692942 0.0174268 -0.0001501 -0.0727978 0.1695216 -0.0002318 0.0003054 -0.0002362 -0.1842409 -0.3560779 -0.0591286 0.0000295 0.0302704 0.033873 0.0000664 -0.0001553 -0.000008 0.0572506 -0.9199733 -0.0404342 -0.0000025 -0.118612 0.0218809 -0.0002527 0.0000955 -0.0001018 -0.1595988 1.4894184 -0.1093636 -0.0000899 0.1998884 0.719199 0.0003163 0.0002606 0.0001422 0.1358857 0.0481913 -0.0637942 0.0000355 -0.0417409 -0.131226 0.0001763 0.0000618 0.0001633 0.1578094 0.0138468 0.0237362 0.086558 -0.0375323 0.087814 -0.0793939 0.1247021 -0.0618704 -0.0258902 0.0138221 0.0236486 -0.0866029 -0.0377 0.087961 0.0792649 -0.1245802 0.0617581 -0.0259495 0.0670654 0.0457638 -0.0000152 -0.0483043 -0.1318125 0.000129 0.0000336 0.0001293 0.1165664 0.0546512 -0.0227895 -0.0000113 -0.0449579 -0.08129 0.0001361 0.0001897 0.0002172 0.1762451 0.0191278 0.0939833 -0.0000296 -0.0371077 -0.2975199 -0.00008 -0.0000366 -0.0004721 0.1065235 unknown
polarizability: 79.8519338|-5.7470757|40.7281888|0.0129875|-0.0103303|25.2579092 unknown
InChI: InChI=1S/C4H6O/c1-2-3-4-5/h2-4H,1H3
charge 0 multiplicity 1
11 atoms
O  -2.442207 0.219182 -0.001141
C  1.14951 -0.380954 0.000489
C  2.534276 0.209435 0.000011
C  -0.019061 0.327733 0.000196
C  -1.323539 -0.362622 0.000918
H  1.087901 -1.482446 0.001162
H  3.103613 -0.131456 -0.887031
H  3.103874 -0.130549 0.887232
H  2.51287 1.312382 -0.000556
H  -0.033441 1.425673 -0.000483
H  -1.253996 -1.483579 -0.000396
