program: Gaussian 09
title: 000248608
version: EM64L-G09RevD.01
frameworkgroup: C1[X(C13H6BrCl3)]
method: RPBEPBE
basis: SDD
operation: Freq
keyword: #p
keyword: freq=noraman
keyword: PBEPBE/SDD
title: #p freq=noraman PBEPBE/SDD
converged: YES YES NO NO
title: Mulliken charges:
elementType: Br Cl Cl Cl C C C C C C C C C C C C C H H H H H H
charge: 0.006867 -0.033705 -0.032137 -0.042454 -0.828502 0.360897 0.352135 0.347368 0.234731 -0.372033 -0.353933 -0.303011 -0.376091 -0.107035 -0.238452 -0.114133 -0.213605 0.329211 0.284244 0.280671 0.274631 0.283352 0.260984
chargesum: 0.00000
title: Mulliken charges with hydrogens summed into heavy atoms:
elementType: Br Cl Cl Cl C C C C C C C C C C C C C
charge: 0.006867 -0.033705 -0.032137 -0.042454 -0.499291 0.360897 0.352135 0.347368 0.234731 -0.087789 -0.073263 -0.303011 -0.101460 -0.107035 0.044900 -0.114133 0.047379
polarizability: 3.04865548e+02 -9.67779056e+00 2.08462875e+02 -1.19465318e+00 9.77807436e+00 8.29919122e+01
1716.lowfreq: -3.1812 0.0022 0.0027 0.0029 3.4698 3.8449 29.9506 60.4733 75.5738
frequency: 29.9474 60.4722 75.5735 85.1493 112.7441 147.9966 171.7802 191.4164 213.2359 234.5735 242.4425 260.1319 362.5479 375.0099 379.8279 404.4781 433.9032 465.2243 523.8879 557.3226 564.2150 565.1963 582.8216 642.3571 679.4601 699.5929 746.8179 765.7164 790.8015 835.2448 867.1559 870.0283 888.4814 899.3285 917.4315 964.5145 991.4802 1068.3384 1084.1410 1115.8749 1126.3796 1157.8155 1167.8006 1194.3006 1221.0375 1249.8162 1278.7254 1352.8758 1366.2867 1418.0365 1422.7076 1427.7658 1475.0969 1564.8339 1582.5084 1605.5127 1609.1574 3080.7016 3165.7260 3166.6601 3174.4009 3183.9717 3188.1083
redmass: 27.1465 17.7159 23.3179 6.2813 15.5833 10.3790 20.3642 5.8905 6.5803 9.0496 8.6075 14.2618 7.9594 6.5780 8.1297 8.8877 3.9537 4.6339 5.0649 7.4914 4.7521 4.5664 5.4144 4.8369 7.4649 7.8819 4.2975 4.2938 7.9818 1.4811 1.4339 3.5771 1.5499 1.6501 4.9999 1.3687 7.0345 2.0143 1.7724 2.1045 1.1509 2.6797 1.4010 2.0876 2.0211 2.0597 1.6324 3.8557 8.0299 3.8686 4.2229 2.9500 5.1704 8.6307 8.1054 8.7180 7.9762 1.0872 1.0935 1.0899 1.0935 1.0934 1.0964
irintensity: 0.0143 0.1845 0.3299 0.2869 0.2419 0.0904 0.4692 0.3514 2.7507 0.7390 1.0529 2.1737 1.8886 5.0631 14.6541 14.6422 2.3690 33.1197 5.6258 5.7475 2.2928 0.4565 6.4859 11.4762 10.5273 48.2944 39.0273 7.4230 36.2388 37.2243 22.4693 22.7630 1.7632 18.5893 31.7372 0.5050 10.7383 24.5560 22.7121 10.3317 20.4240 37.2358 40.2656 12.7758 12.3116 9.7445 1.4033 6.9264 3.4953 113.7060 9.9389 82.8745 5.7736 48.0702 11.7207 5.9850 26.9120 1.9359 0.1320 1.0645 0.1505 0.9597 2.0556
temp: 298.150 k
press: 1.00000 atm
elementType: 35 17 17 17 6 6 6 6 6 6 6 6 6 6 6 6 6 1 1 1 1 1 1
symmnumber: 1
zpe: 383085.5 jmol-1
zpe.correction: 0.145910 hartree
zpe.thermalcorrener: 0.160627 hartree
zpe.thermalcorrenthalpy: 0.161571 hartree
zpe.thermalcorrgfe: 0.101606 hartree
zpe.sumelectzpe: -1891.481688 hartree
zpe.sumelectthermal: -1891.466970 hartree
zpe.sumelectthermalent: -1891.466026 hartree
zpe.sumelectthermalfe: -1891.525991 hartree
dipole: 0.2870 0.8957 -1.2686
dipole: 1.5792
quadrupole: -135.8106 -124.3212 -128.6479
quadrupole: -0.9396 0.0362 4.8524
quadrupole: -6.2174 5.2720 0.9453 -0.9396 0.0362 4.8524
hfenergy: -1891.6275971 hartree
pointgroup: C01 [X(C13H6Br1Cl3)]
dipole: 0.0966148 -0.2970512 0.5370659 debye
dipolederiv: -0.1896377 0.0183309 -0.0057991 0.006068 -0.5717001 0.1966575 -0.0068036 0.3889191 -0.3014648 -0.1381821 -0.1221177 -0.0166649 -0.00287 -0.7363628 -0.0821144 0.0019008 -0.1009922 -0.0602479 -0.9591001 -0.1480367 -0.0576177 -0.2136928 -0.154828 -0.0227571 -0.0439697 -0.0170631 -0.0552812 -1.0222716 0.0562997 0.0509225 0.1437973 -0.1211612 -0.0149296 0.0389589 -0.0096568 -0.062711 0.347578 -0.0171649 0.0033801 0.0082445 0.7047803 -0.3391125 0.0141847 -0.5350385 0.4952376 -0.1282697 0.0031743 0.0630012 -0.0455141 0.0717394 0.0338815 0.0128191 0.059614 -0.1162594 -0.1318334 0.063682 -0.0448084 -0.0209115 -0.0167981 0.0276125 -0.0277537 0.0479886 -0.1161721 0.2571022 -0.1696699 -0.0050094 0.0850175 -0.3621774 -0.0460233 -0.0207692 -0.0243877 0.0410289 0.1531465 0.0905974 -0.0008181 -0.0227454 -0.0324925 -0.0064936 0.0313821 0.0337252 0.0075126 -0.3476977 0.0175746 -0.0370083 0.0598694 -0.0229648 0.0216572 0.0150183 -0.0306292 -0.0765427 -0.3288751 -0.0550691 0.0214527 -0.116055 0.0133711 0.0280511 -0.0181408 -0.024131 -0.0712859 0.1442946 0.2924839 0.0061713 -0.0301739 1.1199147 0.1528903 0.0038841 0.1581254 -0.0341639 -0.0159444 -0.1363737 0.0132811 0.0401776 0.0194994 0.0331057 0.0007723 0.0101094 -0.1211598 1.3088507 0.1818971 0.0879175 0.3649052 0.277511 0.0484756 0.0678979 0.0474899 -0.0606747 -0.3741366 -0.1839575 -0.0249372 -0.2293564 -0.3491263 -0.0164407 -0.0410405 -0.0370459 -0.0607837 1.3847104 -0.0781578 -0.0797075 -0.2755244 0.1479303 0.0328168 -0.0655029 0.0215971 -0.0604672 -0.3425577 0.1489238 0.017197 0.2437503 -0.0623998 0.0237924 0.0439085 0.0097251 -0.0933084 0.0075073 0.0076038 -0.001664 -0.0012663 -0.0383306 0.019567 -0.0032919 0.0561685 -0.0410706 0.1018586 -0.0122538 0.0034964 -0.0334195 0.0082852 -0.0193997 -0.0066766 0.0016272 0.1527121 0.0915046 0.0214649 -0.0014115 0.0452945 0.0052665 -0.0205844 0.0076611 0.0017937 0.1489405 0.1032907 0.049425 0.0108614 0.022935 0.00151 -0.0200084 -0.0035133 -0.0278238 0.1595473 0.0598968 0.036596 0.0050528 0.0410998 0.068482 -0.0139544 0.0049178 -0.0148911 0.1674432 0.0187656 -0.0652523 -0.0072878 -0.0696298 0.0300516 -0.0166895 -0.0058433 -0.0152239 0.1591711 unknown
polarizability: 305.5484667|5.3842135|208.3421611|1.0403879|-4.8837675|82.4297067 unknown
InChI: InChI=1S/C13H6BrCl3/c14-13-9-3-6(15)1-2-8(9)12-10(13)4-7(16)5-11(12)17/h1-5,13H
charge 0 multiplicity 1
23 atoms
Br -0.204324 3.186573 -1.124351
Cl 1.315761 -3.225052 -0.382982
Cl 5.160398 0.70269 0.235883
Cl -5.344342 0.206911 0.193779
C  -0.152371 1.728851 0.340389
C  1.081686 0.862276 0.207006
C  -1.29828 0.754734 0.197381
C  0.685969 -0.500264 0.002289
C  -0.791548 -0.567413 -0.003465
C  2.425422 1.253977 0.283311
C  -2.675787 1.014093 0.2622
C  1.70561 -1.462635 -0.12649
C  -1.689666 -1.648361 -0.142929
C  3.403794 0.246096 0.146887
C  3.070356 -1.10777 -0.058002
C  -3.548888 -0.085175 0.119336
C  -3.0817 -1.400672 -0.082074
H  -0.180221 2.343365 1.253552
H  2.709485 2.300441 0.420808
H  -3.062753 2.028165 0.395795
H  -1.327621 -2.667586 -0.292993
H  3.848513 -1.867704 -0.161997
H  -3.795094 -2.222439 -0.190633
