program: Gaussian 09
title: 000248615
version: EM64L-G09RevD.01
frameworkgroup: C1[X(C17H12Cl4N2O2)]
method: RPBEPBE
basis: SDD
operation: Freq
keyword: #p
keyword: freq=noraman
keyword: PBEPBE/SDD
title: #p freq=noraman PBEPBE/SDD
converged: YES YES NO NO
title: Mulliken charges:
elementType: Cl Cl Cl Cl O O N N C C C C C C C C C C C C C C C C C H H H H H H H H H H H H
charge: -0.025048 -0.025043 -0.004380 -0.004391 -0.217087 -0.217086 -0.474927 -0.475013 -0.688131 0.432256 0.432248 0.232399 0.232426 -0.649096 -0.649014 -0.433766 -0.433778 0.766100 0.765970 -0.331989 -0.331985 0.222252 0.222339 -0.770055 -0.769981 0.278203 0.278202 0.271517 0.271518 0.312429 0.312434 0.258845 0.260690 0.215724 0.258892 0.260639 0.215688
chargesum: 0.00000
title: Mulliken charges with hydrogens summed into heavy atoms:
elementType: Cl Cl Cl Cl O O N N C C C C C C C C C C C C C C C C C
charge: -0.025048 -0.025043 -0.004380 -0.004391 -0.217087 -0.217086 -0.162498 -0.162579 -0.131726 0.432256 0.432248 0.232399 0.232426 -0.649096 -0.649014 -0.162249 -0.162260 0.766100 0.765970 -0.331989 -0.331985 0.222252 0.222339 -0.034796 -0.034762
polarizability: 4.44834919e+02 5.59921296e-04 2.58782709e+02 -5.79370872e+00 3.15165443e-03 1.26575122e+02
1716.lowfreq: -5.6398 -0.0022 -0.0013 0.0004 0.8169 2.4491 26.4799 34.7746 44.7774
frequency: 26.4685 34.7742 44.7757 52.2940 56.5761 60.8463 68.9249 73.4595 76.3920 84.6880 99.1186 131.2557 142.3401 154.5108 160.4267 184.4075 193.9724 201.7620 235.0077 271.6368 276.7617 281.0859 289.7218 306.8380 324.5875 334.9431 380.1501 386.2215 396.8178 441.3630 441.9393 517.5919 518.2514 527.1896 529.0694 532.9654 543.7635 562.7660 576.8334 582.7145 632.5624 660.1654 667.2643 680.5742 708.9249 728.4917 737.7466 739.1732 784.8216 794.5351 847.5166 881.2181 886.8568 906.1216 918.3429 937.0993 974.5150 978.2737 1010.3142 1020.1994 1037.2590 1037.4327 1061.3925 1129.3798 1158.8831 1180.9078 1203.4270 1214.0442 1226.9574 1237.7401 1267.6052 1305.6711 1336.6645 1358.0438 1384.5534 1384.6602 1408.2688 1412.2291 1428.4580 1437.9809 1440.2670 1445.3102 1450.7077 1465.7272 1468.5913 1469.6367 1477.8465 1560.8778 1570.9321 1615.3726 1617.9267 1647.0482 1647.5451 2994.8770 2994.9415 2996.7861 3040.3883 3084.7351 3084.8623 3121.7759 3121.9545 3168.1184 3170.2653 3526.2538 3526.3287
redmass: 5.5414 7.6067 4.9752 1.2844 1.6750 2.6179 3.4342 4.8012 4.5198 6.4989 9.5410 15.0584 9.1295 3.9256 23.0654 13.8587 8.4152 16.0514 4.7126 5.6440 4.8358 5.3764 2.6505 5.7070 13.2008 8.3995 10.2907 5.6504 6.8196 4.2895 3.8282 1.8082 1.3682 3.1342 4.9080 3.7631 4.6454 4.2874 3.4207 3.6848 5.4164 6.5990 8.3221 7.1244 5.4799 6.8130 7.2836 3.9417 5.7222 6.0789 7.5603 1.4283 1.6450 4.0105 5.1884 2.3115 2.6139 2.4141 2.0145 2.7736 1.6735 1.6770 9.3374 1.1352 5.5581 2.0679 2.2581 3.5119 1.6502 2.1115 2.5361 5.4801 7.2165 5.1105 1.2259 1.2252 4.3796 1.5372 4.0481 3.6950 1.5307 1.2158 1.3286 1.6075 1.0929 1.1850 2.6691 8.1394 7.8301 9.3241 10.2299 7.0004 7.0154 1.0373 1.0373 1.0614 1.0989 1.0987 1.0987 1.0989 1.0989 1.0932 1.0931 1.0766 1.0766
irintensity: 1.3871 2.0430 0.0734 1.3983 0.1221 2.2732 9.6081 7.0047 2.8889 0.0995 0.5221 0.5495 12.8610 0.9645 0.0175 2.8008 0.0330 0.2036 0.2900 0.4967 1.8062 1.3308 12.1253 5.8345 0.0015 2.4141 5.3745 20.6919 0.1173 8.3615 0.0014 97.6240 24.7015 39.1984 0.7121 45.2286 13.4069 1.9824 0.0084 6.5589 12.3162 21.2050 9.0077 22.7775 15.3308 76.6444 9.7270 9.6469 2.8544 4.5528 48.1169 36.4373 0.1134 3.6743 5.8876 5.2923 48.1716 0.3553 15.1043 5.5230 40.9327 8.4391 72.1107 0.0100 13.8145 0.8877 7.2716 263.7295 39.8078 3.1676 144.0775 15.7888 213.4216 69.8369 123.3418 3.7143 59.5564 0.0127 21.1674 387.6179 2.0384 111.2883 7.2946 408.1045 38.4893 95.1678 1.7104 0.6412 78.0838 0.0347 32.7133 224.5269 56.9142 10.7709 9.4847 1.5576 1.3897 13.2679 14.2753 9.2796 9.2763 0.6755 0.1280 24.8080 22.9201
temp: 298.150 k
press: 1.00000 atm
elementType: 17 17 17 17 8 8 7 7 6 6 6 6 6 6 6 6 6 6 6 6 6 6 6 6 6 1 1 1 1 1 1 1 1 1 1 1 1
symmnumber: 1
zpe: 661059.8 jmol-1
zpe.correction: 0.251784 hartree
zpe.thermalcorrener: 0.276509 hartree
zpe.thermalcorrenthalpy: 0.277454 hartree
zpe.thermalcorrgfe: 0.194538 hartree
zpe.sumelectzpe: -2753.479923 hartree
zpe.sumelectthermal: -2753.455198 hartree
zpe.sumelectthermalent: -2753.454254 hartree
zpe.sumelectthermalfe: -2753.537170 hartree
dipole: 0.0004 4.0602 0.0004
dipole: 4.0602
quadrupole: -150.7122 -170.9293 -180.5526
quadrupole: -0.0026 -31.0255 0.0009
quadrupole: 16.6859 -3.5313 -13.1546 -0.0026 -31.0255 0.0009
hfenergy: -2753.7317076 hartree
pointgroup: C01 [X(C17H12Cl4N2O2)]
dipole: -0.0006705 1.5973922 0.0046822 debye
polarizability: 443.7785243|0.1162079|258.7815729|-19.2000817|0.3890955|127.6326521 unknown
InChI: InChI=1S/C17H12Cl4N2O2/c1-6(24)22-16-12(18)4-8-9-5-13(19)17(23-7(2)25)15(21)11(9)3-10(8)14(16)20/h4-5,22-23H,3H2,1-2H3
charge 0 multiplicity 1
37 atoms
Cl 3.102392 2.841115 -0.388099
Cl -3.104853 2.836602 0.404829
Cl 4.129734 -2.647141 -0.766509
Cl -4.128437 -2.65459 0.749729
O  5.64892 -0.759617 1.271532
O  -5.648533 -0.755178 -1.277441
N  4.868873 0.370269 -0.625434
N  -4.869698 0.363195 0.626816
C  -0.000882 1.801663 0.005158
C  1.169645 0.8480 -0.160347
C  -1.170765 0.846226 0.164851
C  0.729082 -0.50903 -0.102617
C  -0.729292 -0.510131 0.098856
C  2.529547 1.108466 -0.331145
C  -2.53084 1.104719 0.337239
C  1.638983 -1.574658 -0.247258
C  -1.638466 -1.577233 0.236993
C  3.492277 0.065785 -0.459601
C  -3.492876 0.060628 0.459284
C  2.998951 -1.270633 -0.445189
C  -2.998645 -1.275352 0.436742
C  5.885294 -0.057709 0.254609
C  -5.885626 -0.059866 -0.256154
C  7.286818 0.379239 -0.156578
C  -7.287561 0.373802 0.157102
H  0.120944 2.464172 0.883272
H  -0.123171 2.469413 -0.868911
H  1.312683 -2.617828 -0.235438
H  -1.311464 -2.62009 0.218834
H  5.104137 1.1064 -1.29554
H  -5.105558 1.094922 1.301512
H  7.776573 -0.447251 -0.703254
H  7.878768 0.579197 0.749941
H  7.29594 1.27377 -0.804103
H  -7.778738 -0.458049 0.69426
H  -7.877868 0.583384 -0.748342
H  -7.297388 1.261592 0.813805
