program: Gaussian 09
title: 000248599
version: EM64L-G09RevD.01
frameworkgroup: C1[X(C12H14N2O3)]
method: RPBEPBE
basis: SDD
operation: Freq
keyword: #p
keyword: freq=noraman
keyword: PBEPBE/SDD
title: #p freq=noraman PBEPBE/SDD
converged: YES YES NO NO
title: Mulliken charges:
elementType: O O O N N C C C C C C C C C C C C H H H H H H H H H H H H H H
charge: -0.265038 -0.432484 -0.238417 -0.152253 -0.450503 0.418912 0.513338 -0.330430 -0.345019 -0.485387 -0.365045 -0.646416 -0.646138 0.180517 -0.250873 -0.280322 0.172337 0.238818 0.239909 0.216203 0.306381 0.219289 0.233443 0.233527 0.236225 0.217490 0.236791 0.315065 0.279564 0.249285 0.381229
chargesum: 0.00000
title: Mulliken charges with hydrogens summed into heavy atoms:
elementType: O O O N N C C C C C C C C C C C C
charge: -0.265038 -0.051255 -0.238417 -0.152253 -0.135438 0.418912 0.513338 -0.091611 -0.105109 -0.269185 -0.058664 0.039843 0.044369 0.180517 0.028691 -0.031037 0.172337
polarizability: 4.32224597e+02 8.20972579e+00 1.56951836e+02 -2.84472071e+00 -5.77465536e-01 7.78045814e+01
1716.lowfreq: -3.5988 -0.0004 -0.0001 0.0005 4.5782 9.8612 25.3974 36.2849 50.7926
frequency: 25.3256 36.2736 50.7834 60.7148 77.3961 99.3593 119.2449 133.4099 159.5753 165.3075 190.5352 206.3342 229.3576 249.6991 317.9678 369.5564 377.7276 391.6706 417.8578 466.0457 475.4695 520.1842 528.1800 570.5384 577.8021 630.6523 637.8573 644.5289 656.0059 718.4686 725.0108 741.1264 798.0486 829.3922 838.9922 883.3255 924.1115 925.2480 942.1714 961.8309 978.2023 990.8955 995.6821 1051.2251 1056.6170 1108.6324 1109.8404 1137.1085 1166.0959 1201.0250 1218.6798 1225.0388 1261.6366 1262.7505 1265.4499 1321.4173 1328.3109 1361.9699 1377.5777 1426.7444 1441.7225 1458.8227 1463.6271 1475.1306 1487.8402 1500.7318 1506.6094 1526.7839 1563.2358 1579.5972 1620.2682 1642.4837 1646.7756 2937.2613 2945.9665 3001.3682 3007.2750 3097.5751 3106.7424 3107.3644 3142.1298 3149.1375 3162.1450 3169.5080 3193.1230 3521.3818 3525.9096
redmass: 4.3677 6.1274 6.8232 4.4505 2.8241 3.5563 1.9438 4.8551 2.8048 3.7006 3.7778 1.1429 4.1154 2.5519 4.8806 4.9756 6.2679 4.6589 3.0476 3.8127 3.6916 2.6511 2.6613 4.6157 1.7686 5.6407 1.4218 3.1976 2.0778 6.6179 3.8368 5.5777 1.3747 1.6148 5.6026 2.2685 2.5129 2.1389 3.2425 4.2279 1.3107 1.1329 2.7568 2.1533 1.4980 1.2406 1.3180 1.4231 1.6941 1.1601 1.9675 1.6895 1.4794 2.8614 1.9010 1.6274 2.0024 3.2525 5.4388 1.5380 2.0204 1.2110 1.0421 1.0461 1.3937 1.5684 1.1479 2.4969 8.5083 3.5715 6.5685 7.5460 6.0881 1.0372 1.0393 1.1002 1.1019 1.0957 1.0921 1.0917 1.0971 1.0864 1.0889 1.0925 1.0952 1.0761 1.0641
irintensity: 0.5406 0.3040 0.0627 0.5032 0.7200 11.7947 0.1273 1.9624 2.7915 1.6385 0.4743 0.0299 0.8086 1.8817 0.7901 9.8713 12.0394 3.5779 0.1049 12.5674 5.0100 53.1136 16.2723 31.3317 58.3458 5.9526 120.3027 2.1711 4.4603 32.5037 3.8901 2.7172 32.5243 76.8127 20.1958 10.7221 12.5506 9.1484 21.9678 52.9057 4.6301 56.3504 10.1307 534.3421 28.3003 0.0471 0.9444 8.5207 4.6993 60.0119 10.6351 29.1954 53.8245 33.4150 10.0197 44.6580 86.9403 215.0858 24.0771 1.9235 3.6736 34.2663 0.4689 22.5871 30.6886 10.6324 47.2591 253.1401 171.5757 27.7120 1222.6462 67.9770 59.2057 116.6241 174.8028 27.1482 64.4907 4.4492 48.2817 12.8584 9.0984 2.5167 14.7949 16.9224 6.4605 10.8159 68.9207
temp: 298.150 k
press: 1.00000 atm
elementType: 8 8 8 7 7 6 6 6 6 6 6 6 6 6 6 6 6 1 1 1 1 1 1 1 1 1 1 1 1 1 1
symmnumber: 1
zpe: 637002.5 jmol-1
zpe.correction: 0.242621 hartree
zpe.thermalcorrener: 0.259820 hartree
zpe.thermalcorrenthalpy: 0.260764 hartree
zpe.thermalcorrgfe: 0.195730 hartree
zpe.sumelectzpe: -799.596242 hartree
zpe.sumelectthermal: -799.579043 hartree
zpe.sumelectthermalent: -799.578099 hartree
zpe.sumelectthermalfe: -799.643133 hartree
dipole: -5.5020 -4.7945 0.1838
dipole: 7.3002
quadrupole: -76.0322 -100.9363 -104.1506
quadrupole: -12.3702 1.6937 2.1565
quadrupole: 17.6741 -7.2299 -10.4442 -12.3702 1.6937 2.1565
hfenergy: -799.8388631 hartree
pointgroup: C01 [X(C12H14N2O3)]
dipole: 2.2030992 1.4942377 1.078232 debye
polarizability: 432.1764649|-3.5891095|133.9753369|9.8774077|35.6642475|100.8292121 unknown
InChI: InChI=1S/C12H14N2O3/c1-14(2)10-5-3-9(4-6-10)13-11(15)7-8-12(16)17/h3-8,13,16H,1-2H3
charge 0 multiplicity 1
31 atoms
O  -1.37835 -2.000564 -1.350009
O  -5.594871 1.283587 1.319727
O  -6.074372 0.017454 -0.578392
N  4.825199 -0.025086 0.156358
N  -0.8514 0.047288 -0.302371
C  3.431735 -0.020874 0.034834
C  0.567279 -0.021711 -0.213187
C  2.653977 1.11805 0.422071
C  2.723312 -1.153188 -0.480548
C  1.256331 1.110617 0.29719
C  1.324047 -1.159789 -0.603591
C  5.519862 1.149456 0.695695
C  5.592805 -1.209061 -0.248962
C  -1.734598 -0.895834 -0.821319
C  -3.182366 -0.542621 -0.727414
C  -3.768829 0.231016 0.234437
C  -5.229803 0.45957 0.237242
H  3.139217 2.012419 0.821469
H  3.269379 -2.047601 -0.792474
H  0.691622 2.001736 0.603041
H  0.8051 -2.032468 -1.004368
H  6.604213 0.958249 0.713644
H  5.198849 1.379363 1.732653
H  5.345347 2.053389 0.076481
H  5.305178 -2.106996 0.335321
H  6.665668 -1.025878 -0.080946
H  5.45177 -1.443128 -1.323862
H  -1.267248 0.925387 0.018423
H  -3.81681 -1.033855 -1.475802
H  -3.212765 0.688481 1.06053
H  -6.580278 1.422098 1.302126
