program: Gaussian 09
title: 000248662
version: EM64L-G09RevD.01
frameworkgroup: C1[X(C18H24O8S)]
method: RPBEPBE
basis: SDD
operation: Freq
keyword: #p
keyword: freq=noraman
keyword: PBEPBE/SDD
title: #p freq=noraman PBEPBE/SDD
converged: YES YES NO NO
title: Mulliken charges:
elementType: S O O O O O O O O C C C C C C C C C C C C C C C C C C H H H H H H H H H H H H H H H H H H H H H H H H
charge: 0.968392 -0.247538 -0.297075 -0.244849 -0.290460 -0.403541 -0.262686 -0.497918 -0.500110 -0.087536 -0.172576 -0.092030 -0.091288 -0.131169 0.354978 -0.356834 0.353479 -0.658478 -0.688614 -0.699058 -0.682489 -0.012843 -0.275939 -0.216049 -0.201274 -0.219536 -0.213655 0.228382 0.272871 0.329899 0.249805 0.245788 0.202190 0.237973 0.247890 0.216862 0.225621 0.243672 0.225834 0.210233 0.216816 0.230833 0.241059 0.264691 0.217825 0.211820 0.296028 0.318615 0.246418 0.244980 0.240592
chargesum: 0.00000
title: Mulliken charges with hydrogens summed into heavy atoms:
elementType: S O O O O O O O O C C C C C C C C C C C C C C C C C C
charge: 0.968392 -0.247538 -0.297075 -0.244849 -0.290460 -0.403541 -0.262686 -0.497918 -0.500110 0.140847 0.100295 0.237869 0.158517 0.114619 0.354978 0.083329 0.353479 0.031896 -0.008876 -0.010351 0.011846 -0.012843 0.020089 0.102566 0.045143 0.025444 0.026938
polarizability: 2.85598711e+02 -8.72669095e-01 2.59737369e+02 2.14854048e+01 1.51085353e+01 1.80999820e+02
1716.lowfreq: -5.9022 -1.6491 -0.0017 -0.0016 0.0009 7.4307 10.1574 20.2498 29.0506
frequency: 9.0039 19.9005 28.4838 33.8161 48.9913 51.8376 64.3485 68.4781 81.3435 95.2856 135.7465 138.7221 146.1512 153.7244 166.4857 171.1238 187.4805 202.1108 220.8696 227.3938 231.9294 238.5182 248.8905 278.9159 307.3888 320.3658 334.9421 344.1172 354.6105 371.7471 383.0295 394.0579 402.3503 417.9990 440.6300 451.5326 481.3221 483.9727 504.9167 534.7459 555.5601 596.9648 602.3387 619.9470 633.0206 658.4930 676.2219 683.0961 707.0457 720.2935 735.1668 740.6380 744.0449 759.4123 796.5825 828.4594 845.7120 847.6385 882.9912 891.6865 908.8227 920.7581 923.7834 928.9683 934.7332 940.0097 950.0536 954.3284 973.9034 976.2811 983.1233 984.2891 989.1524 994.0435 1001.0383 1005.3333 1007.2728 1027.8642 1036.1076 1047.0026 1053.7355 1081.9034 1084.7272 1115.3154 1139.7334 1141.0168 1172.4652 1174.7556 1189.4046 1200.9486 1205.6597 1207.5666 1242.8944 1250.0840 1261.7650 1264.8290 1269.5083 1282.6866 1293.5559 1318.2769 1322.9322 1326.3915 1340.7179 1347.9023 1365.0786 1382.3396 1383.0882 1383.1535 1394.9683 1395.7520 1437.9960 1446.6920 1451.4010 1451.5761 1455.4901 1458.1036 1469.9044 1471.5651 1473.1380 1475.0185 1486.4334 1573.9447 1601.3864 2974.8280 2992.3299 3002.9163 3007.4413 3008.3037 3009.0100 3030.3323 3034.0981 3081.1804 3092.6748 3096.3336 3097.8424 3099.3118 3100.0481 3107.2024 3111.7174 3120.6873 3122.8624 3126.1070 3138.9266 3148.1285 3156.7392 3165.7210 3176.2442
redmass: 4.9615 5.2658 4.1405 5.0655 5.0349 4.3449 5.8682 4.4511 5.1194 4.1447 4.6048 6.7017 1.6193 1.6179 1.1384 4.9370 4.6284 1.5588 3.9996 2.0899 4.8857 1.2733 4.9822 3.7660 4.7829 5.9805 2.6800 2.5249 4.6461 3.6166 3.0733 5.7242 2.8810 3.6030 4.9224 7.7110 4.3797 4.0203 5.1489 6.0073 8.5144 5.7498 6.2167 4.5937 5.8245 7.2851 4.3930 2.4977 5.5034 6.0976 4.5758 7.2958 3.2269 1.3891 4.0063 15.7001 1.3243 4.6734 3.5350 2.7898 3.6970 1.9260 1.5441 3.2360 1.3702 1.9602 2.4213 13.5982 4.4691 4.9214 1.5490 1.4344 3.7917 1.3773 4.8869 1.4254 3.8353 4.3385 4.2153 2.0374 5.1899 3.2478 1.6180 2.3424 1.8996 1.8822 1.1679 1.0629 1.1339 2.1824 2.6370 1.7174 1.2300 2.7885 1.3487 2.7435 1.5683 1.3657 1.2670 1.2691 1.1722 1.2242 1.1356 1.2084 1.3912 1.3067 1.3156 7.2284 1.2188 1.2163 2.2415 1.0491 1.0464 1.0522 1.0506 1.9200 1.0529 1.0630 1.0522 1.0680 1.0757 5.6345 6.8185 1.0684 1.0356 1.0360 1.0365 1.0790 1.0389 1.0865 1.0853 1.0879 1.0992 1.0898 1.0999 1.1004 1.0982 1.0993 1.0997 1.1006 1.1009 1.0986 1.0863 1.0900 1.0933 1.0968 1.1013
irintensity: 0.6281 0.5175 0.1034 0.7170 1.0988 0.3046 1.1836 0.1090 1.2883 3.1430 2.5825 1.7402 3.5263 2.4421 1.2657 7.8646 1.6258 2.9991 0.5130 0.5127 1.1015 2.6608 6.1222 2.2199 5.0855 5.0265 3.9645 2.4542 0.6633 2.6044 4.3840 20.5862 0.2748 2.3369 16.2649 61.6318 35.5399 16.1409 29.2557 30.4220 54.6641 10.8411 7.4511 0.5211 8.3031 15.1271 9.0260 39.6728 8.9506 36.8501 43.0936 15.8733 68.0989 76.3675 10.2338 81.1513 1.4018 2.4743 26.1661 3.8942 93.3977 40.2172 6.0521 164.2619 5.3760 6.4331 64.1506 63.9672 4.6385 41.1973 2.8198 4.0323 50.9257 5.8514 109.7066 0.8884 0.5589 34.8396 34.7251 22.1474 36.3042 22.3339 2.2086 4.2010 40.7090 67.6275 29.2425 0.4969 3.9706 36.0249 61.4999 58.6429 3.8566 45.1361 1.7565 42.1575 19.1752 5.7249 5.3467 2.2986 1.8807 1.9120 0.2218 2.5441 0.4528 51.8631 37.6778 4.5086 23.2499 25.9608 17.8486 1.5474 2.8965 3.1824 3.7861 15.5894 14.8296 4.1770 17.5973 11.1827 4.7962 1.4866 0.4443 46.3183 12.6901 7.2910 18.5153 9.9151 12.5046 19.4154 17.6278 3.0745 37.6149 34.4296 1.8820 7.2330 24.5475 34.5410 22.9249 13.8580 16.1397 20.2923 6.5530 24.5574 2.3657 4.3232 29.8927
temp: 298.150 k
press: 1.00000 atm
elementType: 16 8 8 8 8 8 8 8 8 6 6 6 6 6 6 6 6 6 6 6 6 6 6 6 6 6 6 1 1 1 1 1 1 1 1 1 1 1 1 1 1 1 1 1 1 1 1 1 1 1 1
symmnumber: 1
zpe: 1044556.8 jmol-1
zpe.correction: 0.397851 hartree
zpe.thermalcorrener: 0.425432 hartree
zpe.thermalcorrenthalpy: 0.426377 hartree
zpe.thermalcorrgfe: 0.337344 hartree
zpe.sumelectzpe: -1697.887086 hartree
zpe.sumelectthermal: -1697.859504 hartree
zpe.sumelectthermalent: -1697.858560 hartree
zpe.sumelectthermalfe: -1697.947593 hartree
dipole: -5.4438 0.5727 -2.5049
dipole: 6.0198
quadrupole: -150.6484 -168.1954 -169.7049
quadrupole: 5.1812 10.8617 11.7692
quadrupole: 12.2011 -5.3458 -6.8554 5.1812 10.8617 11.7692
hfenergy: -1698.2849363 hartree
pointgroup: C01 [X(C18H24O8S1)]
dipole: -1.8428519 -1.1912869 0.8909864 debye
polarizability: 283.6750179|10.3883186|265.5221164|-7.2851955|-15.7912738|177.1387663 unknown
InChI: InChI=1S/C18H24O8S/c1-17(2)21-10-12(23-17)13-14(15-16(22-13)25-18(3,4)24-15)26-27(19,20)11-8-6-5-7-9-11/h5-9,12-16H,10H2,1-4H3
charge 0 multiplicity 1
51 atoms
S  -1.245331 0.791791 -1.561896
O  3.12774 -1.062449 0.577069
O  0.126211 -2.552445 -0.33585
O  1.91589 -3.139824 1.071699
O  2.446827 2.310332 -0.79713
O  -0.079932 0.220427 -0.176248
O  3.637594 3.484095 0.837765
O  -0.709765 0.075085 -2.916223
O  -1.406378 2.400584 -1.502467
C  2.269533 0.131423 0.3893
C  1.287608 -1.816123 -0.835772
C  1.20962 -0.25307 -0.676612
C  2.488856 -2.265703 0.053186
C  3.200874 1.285833 -0.04691
C  0.430353 -3.062639 1.036256
C  3.853638 2.057391 1.141003
C  2.403611 3.558873 0.022838
C  -0.100706 -2.121392 2.124045
C  -0.118023 -4.484368 1.13344
C  2.522013 4.747767 -0.922905
C  1.14088 3.577581 0.898486
C  -2.835652 0.009843 -0.926698
C  -3.886819 0.884661 -0.609042
C  -2.903194 -1.389939 -0.835804
C  -5.102092 0.304268 -0.17728
C  -4.130424 -1.943507 -0.402163
C  -5.222077 -1.101864 -0.078373
H  1.759446 0.379566 1.339874
H  1.397325 -2.091458 -1.895195
H  1.437968 0.224518 -1.646364
H  3.290421 -2.842192 -0.431539
H  3.955962 0.86921 -0.737844
H  3.380926 1.780937 2.105199
H  4.941223 1.906279 1.211175
H  0.261591 -1.091966 1.984235
H  -1.203804 -2.096559 2.094547
H  0.22518 -2.485836 3.113477
H  0.316126 -5.108056 0.336262
H  0.139963 -4.921783 2.112604
H  -1.216895 -4.475792 1.029085
H  2.559046 5.687506 -0.34618
H  1.65078 4.776647 -1.598376
H  3.44189 4.655807 -1.521457
H  0.2446 3.507934 0.258229
H  1.103355 4.513706 1.48229
H  1.126698 2.726391 1.601556
H  -3.758866 1.967866 -0.699032
H  -2.032969 -2.01639 -1.057599
H  -5.947907 0.950691 0.077693
H  -4.229116 -3.030655 -0.317681
H  -6.167899 -1.542904 0.254123
