program: Gaussian 09
title: 000020139
version: EM64L-G09RevD.01
frameworkgroup: C1[X(C10H14O)]
method: RPBEPBE
basis: SDD
operation: Freq
keyword: #pfreq=noraman
keyword: PBEPBE/SDD
title: #p freq=noraman PBEPBE/SDD
converged: YES YES NO NO
title: Mulliken charges:
elementType: O C C C C C C C C C C H H H H H H H H H H H H H H
charge: -0.438386 0.093559 0.393207 0.354276 0.488440 -0.616955 -0.617283 -0.501480 -0.840419 -0.841859 -0.815024 0.236926 0.234636 0.221898 0.217757 0.267079 0.226238 0.224857 0.236004 0.224454 0.233580 0.223519 0.224678 0.234859 0.335440
chargesum: 0.00000
title: Mulliken charges with hydrogens summed into heavy atoms:
elementType: O C C C C C C C C C C
charge: -0.102947 0.093559 0.393207 0.354276 0.488440 -0.380029 -0.382647 -0.061825 -0.122246 -0.147821 -0.131968
polarizability: 1.40451865e+02 3.09923812e-01 1.24202149e+02 4.34398075e+00 1.01946830e+00 6.93395411e+01
1716.lowfreq: -12.6740 -7.1523 -5.3274 -0.0011 -0.0010 -0.0004 8.7270 81.9652 83.3414
frequency: -11.9263 81.9588 83.3081 145.0141 158.1226 172.2374 214.3942 222.0329 267.4642 291.6275 300.8374 352.8556 392.7162 476.1298 493.8997 523.2857 538.5709 561.7743 585.7402 716.4732 775.4804 865.7701 888.4711 896.4883 916.2096 956.5221 977.2716 1014.7987 1018.1518 1039.1651 1046.3284 1050.6748 1054.4262 1148.4560 1161.0416 1219.0372 1258.7928 1293.6682 1314.8702 1367.9485 1374.7570 1395.7535 1396.5110 1400.1851 1415.7918 1445.3233 1468.1821 1472.9081 1473.6362 1474.9515 1484.4282 1487.4459 1504.5983 1589.2527 1620.0798 2971.9572 2973.2763 2974.7772 3006.2834 3050.6201 3054.2291 3054.8022 3072.3639 3082.3885 3083.3146 3090.3329 3110.6797 3115.1445 3556.4444
redmass: 1.0158 3.4030 3.8018 1.0550 1.0874 2.7632 3.7073 2.8023 2.3795 1.5370 2.1723 1.8036 4.6728 3.5709 3.2488 3.0041 4.0537 4.1535 3.2302 3.2197 3.8552 1.3170 2.2210 1.3128 6.4246 3.5188 1.4079 1.6505 1.5521 1.5359 1.5415 1.6022 1.8809 2.4005 1.2333 1.8517 1.3975 1.2771 5.4581 1.8445 2.1265 1.2450 1.2564 1.2403 2.5235 1.6102 1.0727 1.0692 1.0581 1.1249 1.2891 1.2156 1.2168 6.8359 6.0199 1.0399 1.0386 1.0382 1.0634 1.0973 1.0948 1.0930 1.0997 1.0982 1.0998 1.1002 1.0909 1.0918 1.0664
irintensity: 0.4216 0.1779 2.8122 2.7579 1.1140 5.0686 1.8565 0.3773 3.1147 74.9634 17.4257 62.3153 2.9332 2.5197 2.7453 0.4298 2.4316 0.2078 6.7098 11.2412 7.7037 26.8877 11.1138 0.2655 73.1073 1.2535 2.8871 9.2797 4.5149 6.5704 2.6689 35.1413 1.4081 1.1554 20.6874 4.3871 1.4613 13.3908 4.2785 20.4006 13.3184 19.4093 13.7917 5.0953 0.6332 9.4265 7.4481 7.6901 26.8627 9.4906 23.6391 19.8659 6.6714 17.3824 33.7949 35.2690 41.4490 17.8480 68.3814 18.7190 19.1104 24.1408 29.0149 13.9587 17.9643 7.6452 32.9868 14.3966 5.7714
temp: 298.150 k
press: 1.00000 atm
elementType: 8 6 6 6 6 6 6 6 6 6 6 1 1 1 1 1 1 1 1 1 1 1 1 1 1
symmnumber: 1
zpe: 556517.3 jmol-1
zpe.correction: 0.211966 hartree
zpe.thermalcorrener: 0.223379 hartree
zpe.thermalcorrenthalpy: 0.224323 hartree
zpe.thermalcorrgfe: 0.175345 hartree
zpe.sumelectzpe: -463.850743 hartree
zpe.sumelectthermal: -463.839330 hartree
zpe.sumelectthermalent: -463.838386 hartree
zpe.sumelectthermalfe: -463.887364 hartree
dipole: 1.7464 1.1068 -0.1905
dipole: 2.0763
quadrupole: -70.5961 -61.3247 -67.0098
quadrupole: -3.3116 2.2990 1.5551
quadrupole: -4.2859 4.9855 -0.6996 -3.3116 2.2990 1.5551
hfenergy: -464.0627089 hartree
pointgroup: C01 [X(C10H14O1)]
dipole: -0.6564538 -0.4776534 -0.0907419 debye
dipolederiv: -0.8016966 0.1202296 -0.1793117 0.144955 -0.3334359 -0.1304426 -0.3311279 -0.1711014 -0.5439261 -0.1654364 0.021317 -0.0395975 0.0315836 -0.2551673 -0.0313942 0.0705057 -0.0146175 -0.1908756 0.1305634 0.1711906 -0.0137511 0.1094102 0.2875606 -0.0221105 -0.0298133 -0.0569109 -0.0020569 0.1348125 -0.1419981 -0.0366759 -0.0665931 0.2593531 0.0244417 -0.0696986 0.0537432 -0.0144955 0.4346084 0.0007571 -0.0324055 -0.012079 0.0972892 0.002717 0.0408171 0.0029266 -0.0058802 -0.2624549 -0.1796017 0.0045705 -0.1542664 -0.0687593 0.0057767 0.0039844 0.0218825 -0.2079749 -0.268358 0.1587308 0.0094652 0.1662422 -0.0837155 -0.0007972 0.014664 -0.0081881 -0.2058355 0.5998683 -0.0262999 0.0945439 -0.0706083 0.2823196 0.0651333 0.1435068 0.101469 0.5319676 -0.0594843 -0.1383892 -0.0254362 -0.1010374 -0.1008257 0.0189364 -0.0146513 0.0682405 0.0364464 0.0038888 0.1258472 0.0123745 0.0842482 -0.0721207 -0.0147335 0.0212666 -0.0503159 0.0618987 -0.1642936 0.0019295 0.0112511 0.006423 0.0737798 -0.0013906 -0.0939365 -0.0006173 0.0734992 0.0245124 0.0842641 0.0147439 0.1013059 -0.0823164 -0.0139678 0.0184766 -0.022571 0.1419537 0.0220811 -0.0868368 0.0121932 -0.1040854 -0.0840468 0.0044929 0.0183161 0.0092426 0.144003 0.0027896 0.0545197 -0.0079739 0.1152494 -0.1257782 -0.1269801 -0.0173117 -0.0722355 -0.0196764 -0.0023838 -0.0421526 0.016363 -0.1099098 -0.010378 0.1200668 0.002957 0.0628422 -0.0350982 0.0053682 -0.0600701 -0.0725955 -0.0220944 0.0922738 0.0138166 -0.0790433 -0.0355628 0.0423678 0.061304 -0.0550976 0.0831289 -0.04058 0.0273727 0.0097512 0.0963558 0.0687418 -0.098732 -0.0016735 0.1659002 0.0475359 0.0563331 -0.0659198 -0.03577 0.0352793 -0.0598067 0.092261 0.046496 0.0618034 0.0925561 0.0364805 0.0304351 -0.0038191 0.1016734 -0.0614017 -0.083238 -0.0510069 0.0710758 -0.1117508 0.0243267 0.0407818 -0.0217858 -0.126048 0.0364139 -0.004409 -0.0153429 -0.1786318 0.0275236 -0.0604572 -0.048318 0.0189437 0.0237042 0.041701 0.0988957 0.0276227 -0.0207031 0.0253518 -0.1040215 -0.0723067 0.1077072 0.0798486 0.0787226 0.0527132 0.0298643 0.0177234 0.0243083 0.0961765 -0.0624065 -0.1138509 0.0841966 -0.0857354 0.0423376 -0.0600479 0.0032353 -0.0651273 0.0046244 0.1086421 0.0065699 -0.1207958 0.0067157 -0.0824526 0.328399 -0.128743 0.1087153 -0.1316263 0.1656869 0.1186888 0.1268743 0.0864224 0.1763071 unknown
polarizability: 140.3202024|1.5485546|124.340467|-4.3524256|0.6480514|69.3328853 unknown
InChI: InChI=1S/C10H14O/c1-7-4-8(2)10(6-11)9(3)5-7/h4-5,11H,6H2,1-3H3
charge 0 multiplicity 1
25 atoms
O  3.0417 0.383752 0.87959
C  0.827171 -0.030312 -0.220488
C  0.123909 1.209692 -0.115896
C  0.103957 -1.260014 -0.161793
C  -2.015548 -0.009976 0.109695
C  -1.280291 1.199203 0.05203
C  -1.302824 -1.228028 0.005572
C  2.338313 -0.019483 -0.369821
C  0.867364 2.534031 -0.183357
C  0.797818 -2.612229 -0.277662
C  -3.527273 0.000858 0.257986
H  -1.812237 2.155361 0.139115
H  -1.853871 -2.176043 0.055844
H  2.717582 -1.001541 -0.708315
H  2.665275 0.741307 -1.097749
H  1.748361 2.532392 0.481944
H  1.235639 2.737568 -1.208527
H  0.208997 3.372007 0.102664
H  1.230012 -2.768686 -1.284434
H  1.623187 -2.728336 0.44934
H  0.080661 -3.430855 -0.096686
H  -3.890808 -0.904283 0.775858
H  -3.872267 0.882787 0.826158
H  -4.023475 0.034183 -0.731819
H  2.67115 -0.152755 1.626051
