program: Gaussian 09
title: 000248616
version: EM64L-G09RevD.01
frameworkgroup: C1[X(C18H26N2O6)]
method: RPBEPBE
basis: SDD
operation: Freq
keyword: #p
keyword: freq=noraman
keyword: PBEPBE/SDD
title: #p freq=noraman PBEPBE/SDD
converged: NO YES NO NO
title: Mulliken charges:
elementType: O O O O O O N N C C C C C C C C C C C C C C C C C C H H H H H H H H H H H H H H H H H H H H H H H H H H
charge: -0.263063 -0.277585 -0.499748 -0.402373 -0.216282 -0.320025 -0.447424 -0.463529 -0.078315 0.449237 -0.472785 -0.489302 -0.497329 -0.560301 0.389345 -0.743887 -0.744407 -0.748380 0.220584 0.274849 -0.270255 -0.316860 -0.235741 -0.221909 0.175568 0.224604 0.195007 0.202715 0.226873 0.233455 0.186699 0.198202 0.265952 0.218782 0.218758 0.264242 0.207599 0.210816 0.311000 0.223167 0.209192 0.267051 0.209646 0.221147 0.269013 0.298369 0.279627 0.293556 0.207156 0.287427 0.440914 0.388948
chargesum: 0.00000
title: Mulliken charges with hydrogens summed into heavy atoms:
elementType: O O O O O O N N C C C C C C C C C C C C C C C C C C
charge: -0.263063 -0.277585 -0.058834 -0.013425 -0.216282 -0.320025 -0.136424 -0.165161 0.116691 0.449237 -0.043197 -0.069148 -0.033174 -0.122761 0.389345 -0.061230 -0.044996 -0.048575 0.220584 0.274849 0.009372 -0.023304 -0.028585 0.065519 0.175568 0.224604
polarizability: 3.22127124e+02 -1.62313453e+01 2.44303000e+02 5.49494836e+00 6.94273098e+00 1.56066910e+02
1716.lowfreq: -10.5744 -6.3246 0.0004 0.0007 0.0007 2.5523 24.7437 27.5210 49.5146
frequency: 24.6962 27.3363 49.4741 60.7628 65.7788 80.5164 87.8424 92.6062 104.9185 123.0316 153.8299 156.9365 160.4769 165.6204 173.9717 181.4341 197.8296 206.0014 207.9507 217.1765 219.3076 229.3736 237.8204 256.5583 266.7101 273.1947 289.6527 313.4386 352.7582 370.9210 388.0373 404.2793 411.4944 434.1186 465.9607 474.0365 478.1219 495.5151 511.6904 517.8159 528.0833 538.7568 576.8204 584.2757 586.3278 604.4646 626.5394 648.2809 661.4567 729.3522 734.6496 737.5349 750.0479 771.8306 782.3230 818.1771 844.4457 875.3875 892.0846 909.3493 914.3844 921.0456 929.7474 931.7980 933.3377 941.9520 965.4312 969.7860 972.4496 991.2375 997.2555 998.3061 1016.2412 1027.1280 1031.1368 1050.9250 1059.7376 1085.4878 1095.8984 1127.5570 1132.7091 1140.6151 1163.7468 1177.3144 1197.5431 1199.9746 1209.4316 1218.4539 1234.9997 1238.5986 1251.0753 1264.2541 1276.9717 1287.7384 1303.4587 1313.3073 1314.0551 1327.8051 1334.7790 1341.1476 1345.1106 1359.0682 1364.3044 1375.8126 1385.4858 1393.7155 1448.7276 1450.9876 1453.6551 1456.1554 1461.8086 1468.6005 1474.0784 1483.0176 1485.8893 1488.4684 1490.0062 1507.8650 1579.9792 1591.0034 1604.2167 1646.1770 1648.0756 1658.8259 2949.2941 2960.7773 2971.7302 2975.1172 2981.7587 2989.1167 2989.7307 2993.5169 3034.4902 3047.3390 3053.0761 3067.9291 3076.7267 3087.4160 3091.8098 3096.4336 3099.7861 3105.5921 3110.3145 3129.7417 3158.7401 3163.6558 3178.6446 3517.1805 3530.3641 3532.2311
redmass: 7.2352 5.6941 6.3331 6.4153 5.1925 5.9226 4.4715 5.6806 6.6208 5.4731 3.9685 3.9920 4.2266 3.1247 4.9884 2.3482 4.2867 3.2811 4.4844 2.8789 1.0950 1.3558 1.9814 2.1735 2.6919 2.2194 6.2018 2.5692 2.8302 2.6499 2.4871 3.4664 2.8545 3.4244 3.0195 2.6526 2.4187 2.4625 1.8838 2.2350 3.4171 1.4348 3.8788 2.3846 2.5373 3.5575 4.1084 3.7317 1.8524 9.3613 6.3209 5.3176 3.2333 1.6113 3.1264 2.6110 1.2335 2.3539 2.2031 2.0675 2.4863 2.0343 1.5256 3.0052 2.6190 2.4391 2.6777 2.3422 3.6896 1.2653 1.7720 1.4023 1.1362 1.7345 1.8275 2.0708 1.9968 2.1271 1.8850 1.7033 1.6601 2.9506 1.9127 2.0557 2.6999 2.3823 1.3029 1.4886 1.6769 2.2578 1.5254 1.5746 1.5682 2.0794 1.3355 1.4039 1.6973 1.3437 1.4119 2.3778 1.5390 1.4974 1.4463 1.1942 1.2222 1.1968 1.3117 1.1129 1.2978 1.0762 1.0854 1.0907 1.1045 1.2481 1.0850 1.0619 1.3901 1.0627 6.7791 6.0857 7.2612 9.2170 6.8408 5.4923 1.0713 1.0732 1.0649 1.0681 1.0390 1.0581 1.0407 1.0370 1.0972 1.0940 1.0945 1.0973 1.0996 1.0986 1.0984 1.0951 1.0997 1.1001 1.0992 1.0909 1.0915 1.0919 1.0700 1.0641 1.0767 1.0768
irintensity: 0.2969 2.3608 1.5364 2.3719 1.2907 2.6061 5.3506 1.8976 2.9298 1.8040 6.5309 2.2972 0.6164 4.5505 7.5095 3.0344 5.4570 3.2675 5.0003 8.9657 0.6737 0.0786 2.0092 2.9192 2.7163 0.2145 2.7515 0.2170 0.1895 0.1118 4.0269 10.8418 5.1573 1.7618 24.1396 5.8114 10.2888 21.4792 43.5275 27.5798 7.0994 99.2187 7.0162 88.0821 73.4160 6.6537 7.4097 16.8540 72.8201 6.2246 25.3454 12.9771 5.3648 2.5535 3.1231 15.3751 330.6211 20.5386 8.5210 0.1698 6.5317 4.9471 0.1640 5.3322 12.2604 2.9627 4.5644 18.7125 0.6502 37.1987 5.4080 3.6243 85.7472 15.1198 22.2089 1.2790 738.2398 208.1517 2.1259 13.4129 5.1994 4.1366 0.5010 8.8700 11.1608 69.5005 21.1039 13.0531 26.3733 18.0409 23.4120 1.8374 5.1878 27.7675 0.6009 69.0679 25.3306 4.4472 3.4966 122.0269 7.5912 69.8415 28.8422 27.9246 18.9465 33.4457 156.8352 36.7819 142.8332 7.9912 8.7348 47.3963 20.6851 48.7521 8.3624 14.1909 177.4486 5.3661 222.7691 265.9557 200.5571 150.3146 33.9533 86.0597 16.6114 9.0574 57.3772 31.9500 21.8369 52.7755 34.5210 26.2155 24.0625 37.6125 56.7511 7.5262 41.4503 20.3091 37.0550 19.6385 11.3774 5.8104 15.0257 18.4873 0.8491 0.3705 978.7687 79.9995 41.2500 12.5368
temp: 298.150 k
press: 1.00000 atm
elementType: 8 8 8 8 8 8 7 7 6 6 6 6 6 6 6 6 6 6 6 6 6 6 6 6 6 6 1 1 1 1 1 1 1 1 1 1 1 1 1 1 1 1 1 1 1 1 1 1 1 1 1 1
symmnumber: 1
zpe: 1109725.1 jmol-1
zpe.correction: 0.422672 hartree
zpe.thermalcorrener: 0.449931 hartree
zpe.thermalcorrenthalpy: 0.450875 hartree
zpe.thermalcorrgfe: 0.365839 hartree
zpe.sumelectzpe: -1260.396486 hartree
zpe.sumelectthermal: -1260.369228 hartree
zpe.sumelectthermalent: -1260.368283 hartree
zpe.sumelectthermalfe: -1260.453320 hartree
dipole: 1.4430 -3.4493 -2.8984
dipole: 4.7309
quadrupole: -142.8441 -183.8503 -157.0253
quadrupole: -19.4117 -8.8322 -5.9542
quadrupole: 18.3958 -22.6104 4.2146 -19.4117 -8.8322 -5.9542
hfenergy: -1260.8191582 hartree
pointgroup: C01 [X(C18H26N2O6)]
dipole: -0.6669246 1.3430027 1.1026675 debye
polarizability: 264.8180975|37.5252854|302.2564522|-3.175897|2.260798|155.4224847 unknown
InChI: InChI=1S/C18H26N2O6/c1-17(2,19-13(21)4-6-15(23)24)12-8-10-18(3,11-9-12)20-14(22)5-7-16(25)26/h4-7,12,19-20,23,25H,8-11H2,1-3H3
charge 0 multiplicity 1
52 atoms
O  4.195241 0.677549 -1.246629
O  -4.072542 0.234218 -0.474257
O  0.160805 -3.027585 0.685379
O  -4.168002 -4.830864 -0.399521
O  2.150623 -4.045942 -0.02975
O  -1.949093 -4.523556 0.142839
N  2.83449 1.135675 0.612175
N  -1.789675 0.705612 -0.154688
C  -0.365875 2.752498 -0.05838
C  2.659444 2.611025 0.437914
C  0.638918 2.289271 -1.15076
C  0.2257 2.484601 1.355456
C  2.041559 2.910469 -0.96062
C  1.649232 3.075034 1.523139
C  -1.830674 2.199736 -0.25345
C  4.019162 3.328353 0.605474
C  -2.389285 2.606981 -1.646671
C  -2.78276 2.756448 0.842295
C  3.476565 0.285742 -0.27057
C  -2.875867 -0.148336 -0.270093
C  3.184297 -1.180592 -0.097797
C  -2.500904 -1.59619 -0.126193
C  1.979346 -1.621948 0.358184
C  -3.42207 -2.586713 -0.292514
C  1.503563 -3.030873 0.312565
C  -3.070017 -4.013817 -0.153442
H  -0.46929 3.85447 -0.162033
H  0.736474 1.183847 -1.15216
H  0.265585 2.566063 -2.152625
H  -0.426295 2.925326 2.130851
H  0.24123 1.392608 1.560721
H  1.973864 4.012442 -1.061049
H  2.727406 2.550996 -1.74728
H  2.043326 2.832938 2.531527
H  1.590943 4.179266 1.466818
H  4.740019 2.957209 -0.142033
H  3.898706 4.418699 0.468647
H  4.434762 3.148357 1.613853
H  2.426813 0.718493 1.451348
H  -1.811974 2.152696 -2.469098
H  -2.355251 3.706404 -1.75819
H  -3.435458 2.273752 -1.740138
H  -2.756744 3.861672 0.834288
H  -2.500569 2.40428 1.848757
H  -3.81449 2.424965 0.642665
H  -0.870463 0.274391 -0.034001
H  3.922716 -1.876078 -0.513091
H  -1.464025 -1.854509 0.130534
H  1.223412 -0.911946 0.714578
H  -4.460488 -2.342477 -0.539895
H  -0.394403 -3.859218 0.517935
H  -3.903089 -5.786345 -0.305115
