program: Gaussian 09
title: 000020129
version: EM64L-G09RevD.01
frameworkgroup: C1[X(C9H12O2)]
method: RPBEPBE
basis: SDD
operation: Freq
keyword: #pfreq=noraman
keyword: PBEPBE/SDD
title: #p freq=noraman PBEPBE/SDD
converged: YES YES NO NO
title: Mulliken charges:
elementType: O O C C C C C C C C C H H H H H H H H H H H H
charge: -0.296231 -0.435921 0.004615 -0.377771 -0.686143 0.387848 -0.360616 -0.388313 -0.227330 -0.194263 -0.259811 0.185997 0.217635 0.228040 0.233345 0.239013 0.228749 0.236027 0.249355 0.222813 0.227089 0.227809 0.338065
chargesum: 0.00000
title: Mulliken charges with hydrogens summed into heavy atoms:
elementType: O O C C C C C C C C C
charge: -0.296231 -0.097856 0.190612 0.067903 0.014963 0.387848 -0.124589 -0.138958 -0.004517 0.032826 -0.032002
polarizability: 1.42874801e+02 -1.73971977e+00 9.91940692e+01 -2.55485421e+00 -8.55205234e+00 6.35105251e+01
1716.lowfreq: -13.9347 -3.6332 -0.0004 0.0006 0.0009 6.3416 44.6245 73.5680 99.9127
frequency: 44.5990 73.5345 99.9012 137.1388 206.8712 217.4701 245.2982 297.1802 310.1179 344.6894 412.3045 443.1971 500.3297 523.8251 573.7033 610.6121 693.3335 756.5716 769.3285 823.2237 853.5173 888.7508 912.1803 927.2376 960.0743 981.3382 982.4464 983.8657 1020.9203 1053.6028 1071.7656 1083.6057 1143.7670 1166.8070 1177.6943 1213.1177 1217.0689 1295.8572 1312.1271 1325.9455 1349.3678 1369.1421 1385.4046 1387.6745 1442.7273 1464.8241 1467.5657 1474.8717 1481.2030 1590.3027 1610.4706 2952.1985 2992.8963 2994.9790 3092.8986 3096.5421 3099.7736 3127.7065 3136.6639 3155.3339 3163.7713 3172.9480 3566.8808
redmass: 5.0558 3.6685 2.7848 3.4780 1.1602 4.0936 2.6315 1.1948 6.0101 3.1241 2.9452 2.2682 2.9336 3.7576 6.9174 6.3092 2.0574 1.6580 4.6180 1.2559 2.9294 1.4537 1.3164 2.8213 1.3599 1.3602 4.7345 4.0191 2.0791 2.1722 1.2993 1.5209 2.0491 1.0862 1.2116 2.1715 2.1853 1.1750 1.3467 1.2772 1.3365 1.3491 1.6676 2.6404 2.3556 1.0651 1.0643 2.0084 1.1296 6.4395 6.3381 1.0840 1.0366 1.0639 1.1002 1.0998 1.1004 1.0848 1.0889 1.0924 1.0951 1.1005 1.0665
irintensity: 0.3708 1.2019 4.1971 3.5115 1.5166 0.2370 18.3721 125.8227 16.3822 25.3637 0.0573 7.8562 13.5679 6.1233 4.0150 0.6633 32.8645 87.6747 8.9841 1.0732 18.7108 7.1129 12.1485 24.4836 0.3784 2.3255 12.2428 100.5539 6.0452 96.9602 16.7161 22.0577 3.1975 11.9969 58.6022 117.6324 91.5567 1.7028 1.3215 27.7074 8.3865 11.3193 18.1839 21.2599 1.9123 3.9510 14.4070 97.2837 18.5912 23.3296 77.6511 41.9205 22.0305 33.8716 7.8507 22.8349 36.9411 2.9862 11.4561 33.0409 24.9085 4.8687 9.1174
temp: 298.150 k
press: 1.00000 atm
elementType: 8 8 6 6 6 6 6 6 6 6 6 1 1 1 1 1 1 1 1 1 1 1 1
symmnumber: 1
zpe: 497832.3 jmol-1
zpe.correction: 0.189614 hartree
zpe.thermalcorrener: 0.200641 hartree
zpe.thermalcorrenthalpy: 0.201585 hartree
zpe.thermalcorrgfe: 0.152500 hartree
zpe.sumelectzpe: -499.744845 hartree
zpe.sumelectthermal: -499.733818 hartree
zpe.sumelectthermalent: -499.732874 hartree
zpe.sumelectthermalfe: -499.781959 hartree
dipole: 0.6062 1.1880 -1.2566
dipole: 1.8325
quadrupole: -70.0849 -61.4241 -65.3353
quadrupole: -1.9419 3.9418 -2.7442
quadrupole: -4.4701 4.1906 0.2795 -1.9419 3.9418 -2.7442
hfenergy: -499.9344589 hartree
pointgroup: C01 [X(C9H12O2)]
dipole: 0.2780356 -0.2855079 0.6007946 debye
dipolederiv: -1.9802929 -0.0586844 0.015301 0.0883861 -0.3556832 -0.0423856 0.0293373 -0.0204602 -0.296757 -0.8211318 0.0512482 0.3011026 0.02425 -0.5653833 0.0013496 0.3577485 0.0256954 -0.2696258 0.8711361 0.1556732 0.0024317 0.4946442 0.3130192 0.0494485 -0.2388464 0.0760569 0.3811467 0.567961 0.0283398 -0.1758949 0.0002499 0.3260136 -0.057827 -0.2019132 -0.055986 0.3609871 -0.1281099 -0.0028913 -0.0001956 -0.1321322 -0.1380794 -0.0912781 0.0223068 -0.1333468 -0.0425263 1.6319153 -0.0634869 0.0653881 -0.4063063 0.0732876 0.0064186 0.206516 0.0046434 0.0979175 -0.3089595 -0.0015588 0.0166271 0.3279627 -0.1084673 -0.0462818 -0.1924073 -0.0536196 -0.1807468 -0.436766 0.0280592 -0.0256447 -0.155775 -0.017309 -0.1083753 0.0967486 -0.104852 -0.1254878 0.1628895 0.0610676 -0.0454938 -0.0556 0.071531 -0.1370865 0.0219736 -0.130519 -0.0582751 0.1637709 -0.0225143 0.0116341 0.0076586 0.0733001 -0.1359125 -0.0163903 -0.1319656 -0.0565081 -0.0480999 -0.0640678 0.0329359 -0.0205521 -0.2052505 0.0053094 0.0097508 0.0041356 -0.2090636 -0.0313416 0.004777 -0.071207 -0.0625193 -0.0037897 0.0464385 0.0166116 0.0400291 -0.1859066 0.0043672 -0.0782133 0.0157959 -0.0559787 -0.1270191 -0.0837953 -0.0022521 -0.1150272 -0.0005474 0.0287191 0.0093957 -0.0291372 0.0000568 0.0792109 0.0327515 -0.0391047 0.0786401 -0.0946661 -0.0154705 0.1415825 0.0140332 0.1479744 -0.00456 -0.0238388 0.0046003 -0.0001151 0.0772287 -0.0498656 -0.1106447 0.0325691 -0.1283815 0.0695872 0.0278611 0.0372736 0.0426283 0.0822764 0.1082845 0.0029743 -0.0286734 0.0377544 0.0486697 0.0927306 -0.0398532 0.0303926 -0.0916526 -0.0100264 -0.0905578 0.0559518 -0.1058175 0.0404832 0.0661723 0.0734897 0.0697028 0.1186107 0.0820882 0.0577314 -0.0330337 0.0476274 0.0115906 0.096741 -0.0231821 0.0961146 0.1106468 0.0547072 0.044269 -0.0269139 0.0656956 -0.0378935 0.1190982 -0.0382533 0.1165956 0.0831443 -0.0242744 -0.091689 0.0597337 -0.0956427 0.021755 0.0843603 0.0637037 0.0846249 0.101949 -0.1283892 0.0411087 -0.0202174 0.0433054 0.1018513 0.0436302 -0.0189387 0.0429989 0.1476666 0.3068887 -0.0419184 -0.1670925 -0.0668601 0.3331355 0.0544711 -0.1289195 0.0336334 0.0501894 unknown
polarizability: 142.8185443|1.5359966|90.4731294|-2.5309757|-17.6928414|72.2877218 unknown
InChI: InChI=1S/C9H12O2/c1-8(7-10)11-9-5-3-2-4-6-9/h2-6,8,10H,7H2,1H3
charge 0 multiplicity 1
23 atoms
O  -0.746372 0.709033 -0.292873
O  -4.202293 0.150862 0.949215
C  -1.839729 -0.146779 0.230807
C  -3.046588 0.810992 0.325298
C  -2.106834 -1.340364 -0.69473
C  0.592036 0.320064 -0.105833
C  1.011822 -0.836869 0.598592
C  1.55264 1.196207 -0.671494
C  2.395193 -1.09968 0.736175
C  2.92612 0.918642 -0.527706
C  3.358473 -0.231105 0.178337
H  -1.574497 -0.488211 1.255453
H  -2.746498 1.727415 0.87142
H  -3.387061 1.0926 -0.683991
H  -1.268342 -2.056991 -0.702819
H  -3.022577 -1.862909 -0.365055
H  -2.265097 -0.981504 -1.727198
H  0.288632 -1.531386 1.035969
H  1.200656 2.081085 -1.210847
H  2.715483 -1.994721 1.281712
H  3.661427 1.601911 -0.967278
H  4.426653 -0.444965 0.288278
H  -4.037049 0.052973 1.920668
