program: Gaussian 09
title: 000020192
version: EM64L-G09RevD.01
frameworkgroup: C1[X(C12H17Cl2NO2)]
method: RPBEPBE
basis: SDD
operation: Freq
keyword: #p
keyword: freq=noraman
keyword: PBEPBE/SDD
title: #p freq=noraman PBEPBE/SDD
converged: YES YES NO NO
title: Mulliken charges:
elementType: Cl Cl O O N C C C C C C C C C C C C H H H H H H H H H H H H H H H H H
charge: -0.067371 -0.068669 -0.331195 -0.305523 -0.201276 0.357667 -0.352042 -0.406263 0.052006 -0.377608 -0.592910 -0.569305 0.261832 -0.224611 -0.389388 -0.522160 -0.527335 0.243303 0.230394 0.231525 0.312886 0.240496 0.292370 0.271638 0.276002 0.265250 0.228146 0.255268 0.256508 0.224068 0.229533 0.255103 0.221889 0.229771
chargesum: 0.00000
title: Mulliken charges with hydrogens summed into heavy atoms:
elementType: Cl Cl O O N C C C C C C C C C C C C
charge: -0.067371 -0.068669 -0.331195 -0.305523 -0.201276 0.357667 0.121655 0.138148 0.052006 -0.137112 -0.028902 -0.028053 0.261832 0.003535 -0.134120 0.187950 0.179429
polarizability: 2.03866257e+02 -2.46542272e+00 1.69735394e+02 5.56074806e+00 2.54057918e+01 1.31227133e+02
1716.lowfreq: -7.5878 -6.4853 -1.3362 0.0019 0.0024 0.0031 25.3057 32.0024 39.5306
frequency: 25.2433 31.8730 39.5124 48.7352 70.9054 78.6935 94.2088 98.1447 113.1048 154.4312 161.6008 166.2668 195.1432 204.8156 216.7317 230.7013 242.3642 275.3236 341.8649 366.1891 373.8318 394.0457 448.0736 501.0709 516.9855 556.7627 570.8240 617.6079 632.8051 672.8961 698.5481 736.4175 773.0228 786.4626 787.1341 793.2009 847.5106 868.9960 939.3451 951.2082 958.4024 1000.7242 1004.0063 1031.2954 1052.4027 1058.6053 1072.8046 1110.1174 1111.5725 1113.0017 1145.2564 1153.9173 1162.2623 1172.8238 1200.2574 1224.5388 1235.2805 1253.6705 1255.9831 1280.1711 1290.6361 1329.6131 1348.9102 1358.2220 1377.3459 1411.8086 1428.6663 1443.2304 1454.8258 1456.3946 1457.7893 1459.5947 1469.1404 1477.1300 1485.5647 1488.2889 1507.3627 1578.0313 1590.4848 2974.3566 2976.4316 2977.3601 3024.2224 3051.8287 3067.1197 3069.4831 3073.9882 3076.8022 3106.8171 3120.4216 3122.4104 3137.7050 3140.1289 3154.0975 3160.7466 3176.8063
redmass: 5.1828 9.0713 7.4702 7.1699 2.9806 3.4007 2.4280 2.7907 2.4279 1.2700 1.1881 2.5597 3.9251 4.2863 6.1811 5.2177 3.9157 4.1143 5.2975 3.8562 4.1198 4.1193 6.5087 5.8677 3.9868 3.7799 4.9954 5.2177 5.0286 6.1197 5.2790 1.8022 5.2424 1.2138 1.2208 2.0340 5.4836 1.4355 7.7030 6.0031 1.3113 1.5148 2.0667 4.1466 3.8860 1.7449 2.1643 1.2628 1.2925 1.4709 1.6370 1.3634 2.2846 1.3267 1.4965 2.2072 2.0797 1.2229 1.1643 1.3591 1.2362 1.5777 1.2866 6.9219 1.4808 1.3867 1.2407 1.9608 1.0968 1.0809 1.0657 1.1010 2.5037 1.0569 1.0620 1.0979 1.0951 6.3620 6.8461 1.0310 1.0303 1.0672 1.0647 1.0569 1.0654 1.0847 1.1032 1.1046 1.1013 1.1033 1.1031 1.0863 1.1112 1.1120 1.0922 1.0978
irintensity: 0.0576 0.5179 0.5824 1.1106 5.7653 1.5020 4.1197 4.9375 0.9344 0.7679 0.7539 2.2038 3.6592 2.8226 2.1402 5.3160 2.6961 18.4895 7.8484 6.3501 20.7754 2.2593 2.7547 15.6745 1.7110 1.7602 5.6074 6.6055 9.5885 39.6938 96.3831 32.0503 4.1586 12.1410 14.8198 34.6978 12.6408 2.2354 41.1929 49.7128 1.0013 5.5008 95.9897 6.3843 5.2649 52.3505 22.8882 5.3875 32.3760 38.7394 14.0921 2.7618 24.8826 4.9443 12.6208 80.9720 46.6075 13.1881 10.6935 20.0299 28.9261 27.4647 0.7787 4.9405 4.4404 17.1275 28.2751 66.2186 6.1696 16.4139 13.1556 6.8758 97.2530 2.0345 10.0390 25.4237 20.1583 29.6518 144.1891 89.3817 49.0355 27.3296 30.8364 18.2460 11.4486 17.9337 25.5751 24.0621 10.6612 19.3004 23.4711 9.3058 10.4058 9.9466 14.2924 7.8968
temp: 298.150 k
press: 1.00000 atm
elementType: 17 17 8 8 7 6 6 6 6 6 6 6 6 6 6 6 6 1 1 1 1 1 1 1 1 1 1 1 1 1 1 1 1 1
symmnumber: 1
zpe: 712038.0 jmol-1
zpe.correction: 0.271201 hartree
zpe.thermalcorrener: 0.290448 hartree
zpe.thermalcorrenthalpy: 0.291392 hartree
zpe.thermalcorrgfe: 0.220761 hartree
zpe.sumelectzpe: -1591.431371 hartree
zpe.sumelectthermal: -1591.412124 hartree
zpe.sumelectthermalent: -1591.411180 hartree
zpe.sumelectthermalfe: -1591.481811 hartree
dipole: 1.5445 -0.7334 0.5069
dipole: 1.7833
quadrupole: -120.7374 -132.0704 -107.2869
quadrupole: -1.5709 2.4031 3.2662
quadrupole: -0.7059 -12.0388 12.7447 -1.5709 2.4031 3.2662
hfenergy: -1591.7025719 hartree
pointgroup: C01 [X(C12H17Cl2N1O2)]
dipole: -0.6535484 0.149466 0.2068637 debye
polarizability: 201.6254513|6.0732728|149.0384168|-4.1106639|-33.2968926|154.164915 unknown
InChI: InChI=1S/C12H17Cl2NO2/c1-16-11-5-3-4-10(12(11)17-2)15(8-6-13)9-7-14/h3-5H,6-9H2,1-2H3
charge 0 multiplicity 1
34 atoms
Cl 4.014533 3.028775 -1.040384
Cl 2.300872 -3.970015 0.859588
O  -0.965263 -0.418322 1.654107
O  -3.548396 -0.001392 0.50948
N  1.392622 0.012586 0.057398
C  0.092108 0.255661 -0.474566
C  2.562403 0.679244 -0.55341
C  1.675146 -1.230346 0.818654
C  -1.085846 0.01704 0.306714
C  -0.087474 0.802683 -1.78078
C  2.559982 2.172093 -0.186925
C  1.912763 -2.409864 -0.143086
C  -2.377845 0.22533 -0.250396
C  -1.373614 1.070696 -2.292764
C  -2.529494 0.767968 -1.544022
C  -1.337081 0.620306 2.645617
C  -3.755333 -1.396897 0.962633
H  3.475863 0.212265 -0.147026
H  2.614558 0.564529 -1.654818
H  2.572128 -1.074295 1.444449
H  0.829615 -1.450029 1.486166
H  0.781773 1.017436 -2.408958
H  1.658604 2.690276 -0.543715
H  2.70143 2.330614 0.89149
H  1.015394 -2.649412 -0.732875
H  2.783914 -2.264686 -0.800617
H  -1.471653 1.497208 -3.296802
H  -3.538152 0.941466 -1.928909
H  -2.395168 0.910593 2.517877
H  -0.682553 1.504523 2.533011
H  -1.180456 0.156227 3.631577
H  -2.913205 -1.738657 1.589384
H  -3.872582 -2.064588 0.088132
H  -4.68909 -1.376416 1.544974
