program: Gaussian 09
title: 000248482
version: EM64L-G09RevD.01
frameworkgroup: C1[X(C11H16O)]
method: RPBEPBE
basis: SDD
operation: Freq
keyword: #pfreq=noraman
keyword: PBEPBE/SDD
title: #p freq=noraman PBEPBE/SDD
converged: YES YES NO NO
title: Mulliken charges:
elementType: O C C C C C C C C C C C H H H H H H H H H H H H H H H H
charge: -0.443380 -0.005196 -0.386653 -0.540235 0.397052 -0.714894 -0.716955 0.124106 -0.399759 -0.400982 -0.253980 -0.215259 0.187099 0.200040 0.223028 0.233653 0.193876 0.206967 0.222204 0.208318 0.212751 0.207431 0.210593 0.235061 0.212665 0.224299 0.225183 0.352965
chargesum: 0.00000
title: Mulliken charges with hydrogens summed into heavy atoms:
elementType: O C C C C C C C C C C C
charge: -0.090415 0.181904 0.036415 -0.112705 0.397052 -0.077404 -0.086180 0.124106 -0.164698 -0.188317 -0.029681 0.009924
polarizability: 1.55013342e+02 -5.62663783e+00 1.22404412e+02 1.06877071e+01 6.92172706e+00 8.29695219e+01
1716.lowfreq: -15.1684 -6.3172 -0.0005 0.0005 0.0006 6.9007 32.3293 41.0956 70.5419
frequency: 31.9975 40.8891 70.4557 107.7217 174.0551 198.4039 209.8021 232.7077 274.6961 290.0898 355.7593 366.6117 388.4578 415.8465 442.0563 468.6310 528.8597 556.7668 595.6130 724.3920 747.3637 751.4445 763.9037 818.6978 837.1064 853.6694 911.9977 922.8955 928.7248 949.9082 968.0928 973.1303 1030.6556 1039.0594 1063.7913 1108.1826 1130.5130 1154.9319 1170.0071 1174.7099 1205.7389 1214.0174 1238.4461 1262.7496 1279.5200 1312.6080 1318.2393 1331.5089 1341.8813 1373.6002 1389.2858 1394.4202 1437.0275 1456.0144 1468.2072 1469.8176 1475.0045 1479.8046 1488.3153 1493.6232 1601.9179 1614.5440 2947.9277 2964.5162 2968.6946 2972.1120 2985.9925 3026.0476 3056.9077 3058.1085 3065.4879 3066.9811 3071.1380 3107.4696 3121.0461 3140.5064 3164.0143 3580.5372
redmass: 2.7844 3.9362 3.6544 2.0514 3.5806 1.4513 1.9309 1.1318 3.1659 2.7636 1.1486 2.4403 2.5846 2.3241 2.8821 2.9716 5.6248 4.0007 5.4100 3.1757 3.5636 1.4382 1.3449 2.4657 1.8284 2.5592 1.1898 1.6581 1.3788 1.3799 1.4803 1.5753 3.0470 2.3037 1.9904 1.4705 2.3267 1.2616 1.0566 1.7769 1.6008 2.1799 2.5233 1.2575 1.2882 1.3181 1.3551 1.4247 1.4712 1.2154 1.2261 6.5257 2.2595 1.0996 1.0460 1.0915 1.0877 1.0600 1.0519 2.5331 6.3583 6.8023 1.0827 1.0360 1.0441 1.0500 1.0620 1.0987 1.1011 1.1006 1.0999 1.0991 1.0985 1.0884 1.0883 1.0920 1.1004 1.0659
irintensity: 0.0215 0.1722 1.1874 0.1468 0.3479 0.1565 0.2800 0.2252 9.2867 3.3092 119.6095 2.3359 0.8331 4.0412 2.3172 12.5286 5.4933 0.1270 2.0395 8.0623 7.0696 85.3876 5.3400 6.2034 9.6153 10.4902 3.9289 4.0898 1.6575 0.6363 0.2688 0.3628 1.6543 10.6741 50.7228 87.5440 10.7618 28.5182 1.0588 9.0108 7.7319 9.2476 35.5975 8.4169 11.0605 17.0508 3.6132 6.0476 0.6915 21.2162 13.7365 7.3870 28.2523 1.2415 2.4499 2.7085 8.1356 8.9071 27.7773 31.8576 18.6199 1.4820 24.3930 31.7312 39.5768 15.2826 46.5042 6.6129 3.2150 15.9316 71.0972 91.4945 57.6841 17.1449 6.7456 23.6244 26.1365 25.0234
temp: 298.150 k
press: 1.00000 atm
elementType: 8 6 6 6 6 6 6 6 6 6 6 6 1 1 1 1 1 1 1 1 1 1 1 1 1 1 1 1
symmnumber: 1
zpe: 632324.4 jmol-1
zpe.correction: 0.240840 hartree
zpe.thermalcorrener: 0.253651 hartree
zpe.thermalcorrenthalpy: 0.254595 hartree
zpe.thermalcorrgfe: 0.201009 hartree
zpe.sumelectzpe: -503.071673 hartree
zpe.sumelectthermal: -503.058862 hartree
zpe.sumelectthermalent: -503.057918 hartree
zpe.sumelectthermalfe: -503.111503 hartree
dipole: 0.8886 0.7499 0.4755
dipole: 1.2562
quadrupole: -69.2931 -65.0185 -76.7436
quadrupole: 4.1057 3.2550 3.7325
quadrupole: 1.0586 5.3333 -6.3919 4.1057 3.2550 3.7325
hfenergy: -503.3125129 hartree
pointgroup: C01 [X(C11H16O1)]
dipole: -0.3566011 0.2662229 -0.2149903 debye
polarizability: 154.5978656|7.5571107|121.1097606|10.4888922|-10.2601151|84.6796499 unknown
InChI: InChI=1S/C11H16O/c1-9(2)7-8-10-5-3-4-6-11(10)12/h3-6,9,12H,7-8H2,1-2H3
charge 0 multiplicity 1
28 atoms
O  -0.615213 2.062568 -0.265851
C  3.177184 -0.349496 0.078518
C  1.679713 -0.310149 -0.327521
C  0.698406 -0.176128 0.871686
C  -0.75635 -0.239062 0.441904
C  3.636172 0.965199 0.754988
C  4.056551 -0.655178 -1.157776
C  -1.394565 0.889965 -0.141219
C  -1.525516 -1.419626 0.576697
C  -2.7415 0.842963 -0.568857
C  -2.873464 -1.48902 0.152561
C  -3.482252 -0.351222 -0.421958
H  3.310509 -1.17789 0.808611
H  1.432525 -1.237359 -0.883696
H  1.511477 0.535873 -1.023083
H  0.888419 0.785177 1.382699
H  0.904044 -0.988151 1.596727
H  4.714098 0.92646 1.00091
H  3.086559 1.164659 1.692492
H  3.472499 1.825966 0.078024
H  3.763222 -1.60949 -1.634163
H  3.954657 0.146226 -1.915167
H  5.125647 -0.724597 -0.882407
H  -1.052354 -2.299988 1.029005
H  -3.211115 1.731322 -1.012848
H  -3.441562 -2.417444 0.272918
H  -4.52584 -0.386934 -0.75322
H  -1.156051 2.798155 -0.646669
