program: Gaussian 09
title: 000248480
version: EM64L-G09RevD.01
frameworkgroup: C1[X(C11H12O3)]
method: RPBEPBE
basis: SDD
operation: Freq
keyword: #pfreq=noraman
keyword: PBEPBE/SDD
title: #p freq=noraman PBEPBE/SDD
converged: YES YES NO NO
title: Mulliken charges:
elementType: O O O C C C C C C C C C C C H H H H H H H H H H H H
charge: -0.398635 -0.235753 -0.221488 -0.285708 -0.548852 0.482965 0.119105 0.259580 -0.397638 -0.417402 -0.230904 -0.223825 -0.773852 -0.242142 0.287684 0.257811 0.256832 0.255212 0.254911 0.226117 0.228729 0.236580 0.256040 0.246491 0.229624 0.378516
chargesum: 0.00000
title: Mulliken charges with hydrogens summed into heavy atoms:
elementType: O O O C C C C C C C C C C C
charge: -0.020118 -0.235753 -0.221488 0.001976 -0.034209 0.482965 0.119105 0.259580 -0.142426 -0.162490 -0.004787 0.004904 -0.034741 -0.012518
polarizability: 1.27239135e+02 1.59282448e+01 1.15111810e+02 -8.26882745e-01 1.09305493e+01 1.16456929e+02
1716.lowfreq: -7.6250 -0.0006 -0.0004 -0.0002 4.9563 12.4477 25.9855 35.1768 42.6476
frequency: 25.8282 35.0820 42.5555 51.2565 94.9733 114.8370 121.8725 173.2745 218.8762 281.4946 303.5133 329.6754 404.1000 439.9107 471.5375 486.7661 545.1818 588.9373 597.9565 616.7946 623.6067 703.1811 706.7009 757.0330 780.4336 815.7787 856.8265 879.8830 910.9122 929.6991 967.5433 980.5378 990.5057 997.7617 1020.9380 1034.3299 1037.8753 1082.6763 1094.6441 1172.1009 1173.9420 1178.7198 1192.4758 1203.1238 1227.7347 1278.1432 1308.4674 1342.7936 1354.0662 1370.3758 1384.4279 1430.0228 1442.6486 1444.1362 1454.2561 1482.0930 1593.9511 1610.0183 1632.9902 1649.1695 2976.6352 2981.1636 3043.6144 3057.4219 3064.9740 3117.5706 3123.3104 3128.0641 3139.6794 3150.6926 3165.1005 3508.0276
redmass: 6.5298 4.5467 3.8182 5.6683 3.8090 1.4575 2.7140 3.1714 6.0347 4.1028 3.6275 5.4710 2.8204 2.5777 2.8107 3.4030 3.3114 3.8656 3.3705 3.2588 1.9721 4.1498 1.8253 1.9462 2.4607 4.0849 1.2458 1.9046 2.6104 1.5510 2.2314 1.4291 5.4191 1.3175 2.3172 2.0329 2.4688 1.6500 2.3426 1.2729 1.3697 1.8887 1.1206 1.6829 1.4972 1.5126 2.0434 1.3080 1.8539 1.2536 6.4650 1.0977 1.0733 2.1253 1.0584 2.2339 6.1206 5.9889 7.9475 8.2585 1.0583 1.0451 1.0871 1.0898 1.0951 1.0869 1.1004 1.0869 1.0920 1.0960 1.1015 1.0639
irintensity: 2.3775 0.7960 0.9231 6.1727 1.7490 1.9242 4.4050 1.6173 0.6576 0.5308 2.2182 1.0361 0.1110 6.0515 14.5527 7.4292 58.5172 7.6618 35.2681 33.1786 74.3728 28.3330 60.2055 29.6655 17.6422 2.2709 0.1795 0.4845 3.3433 0.5483 0.1480 0.2143 0.6400 0.1464 20.5268 60.0337 149.1053 13.2782 54.0047 8.6786 12.2434 13.5519 0.1460 8.8357 34.9840 13.3052 118.0774 10.7270 15.2733 62.4852 2.0061 26.5125 21.1344 6.9362 19.8537 18.7285 5.4834 12.1442 143.7349 138.4053 9.8253 8.8199 2.1002 10.6342 13.1879 2.7375 12.4421 0.3727 16.1064 27.5122 19.3403 25.3800
temp: 298.150 k
press: 1.00000 atm
elementType: 8 8 8 6 6 6 6 6 6 6 6 6 6 6 1 1 1 1 1 1 1 1 1 1 1 1
symmnumber: 1
zpe: 535312.1 jmol-1
zpe.correction: 0.203890 hartree
zpe.thermalcorrener: 0.217763 hartree
zpe.thermalcorrenthalpy: 0.218707 hartree
zpe.thermalcorrgfe: 0.160689 hartree
zpe.sumelectzpe: -651.021192 hartree
zpe.sumelectthermal: -651.007318 hartree
zpe.sumelectthermalent: -651.006374 hartree
zpe.sumelectthermalfe: -651.064393 hartree
dipole: -0.1305 -0.1654 1.5586
dipole: 1.5728
quadrupole: -74.6420 -79.0019 -84.1997
quadrupole: 0.7971 2.9433 -7.4962
quadrupole: 4.6392 0.2793 -4.9185 0.7971 2.9433 -7.4962
hfenergy: -651.2250813 hartree
pointgroup: C01 [X(C11H12O3)]
dipole: -0.0723303 -0.1944419 0.582955 debye
dipolederiv: -0.4137677 0.1266228 -0.0709684 0.0449486 -0.9647315 0.4871711 -0.0328757 0.4546034 -0.5580388 -0.4208761 0.0258622 -0.1957878 -0.1371116 -0.6981667 -0.1617191 -0.3099599 0.0504816 -0.8150304 -0.3974777 0.1162939 -0.0366348 0.1637608 -0.5916823 -0.0221473 -0.067554 0.0074458 -0.7895481 -0.029164 -0.1653138 -0.0768316 -0.0360544 -0.1306328 -0.0587995 -0.1214403 -0.2045652 -0.0125285 0.0487374 -0.0229043 -0.082323 0.029052 -0.3109851 -0.1538538 0.0274028 -0.219027 -0.0959507 0.3527644 0.1606035 0.0199207 0.1004316 -0.0978434 -0.0102557 -0.0133725 -0.0135038 -0.0279977 0.2979412 -0.0165569 0.3668576 0.2229853 1.5291423 -0.1618177 0.4933159 -0.2339288 1.1146361 0.2166782 -0.2394906 0.1289325 -0.4235702 1.0752373 0.0166007 0.0983353 0.0316778 0.8631598 -0.1364086 0.0178199 0.038758 0.0146425 -0.1371188 0.0392195 0.0382901 0.0483208 -0.0225454 -0.1045869 -0.0244958 -0.0877128 -0.0432221 -0.1345044 0.0316029 -0.0500481 0.0479281 0.0342149 -0.0221474 0.0292257 -0.0803486 0.0303396 -0.1283385 0.031385 -0.0924807 0.0265911 0.0977526 -0.0222381 0.0483461 0.0759067 0.066145 -0.1042001 0.0765041 0.071896 0.0545987 0.0690438 0.0121167 0.0860854 -0.0292307 0.1929837 -0.4130939 0.200492 -0.0672098 0.2149453 -0.1375762 0.0686539 0.0736934 -0.0214282 0.0653699 -0.140913 0.0107193 -0.0149806 0.0099927 -0.0704409 0.080065 -0.0001064 -0.0078812 -0.0288413 0.1048403 -0.0009466 0.0233103 0.0757967 -0.0140315 0.0871509 0.0219714 0.0822859 -0.0094769 0.0387137 0.0368629 0.0337411 0.0743344 -0.0312777 -0.1304316 -0.012845 -0.005235 -0.0103809 0.0790786 -0.020424 -0.0222935 0.0172934 0.0985029 0.062981 -0.0393078 -0.0814005 -0.0467415 0.118054 -0.0514436 -0.0728083 -0.0493961 0.0053799 0.0625738 -0.015486 0.0971272 -0.0228418 0.1360018 -0.0174957 0.0799067 -0.0186163 -0.0056226 0.028906 -0.0192404 0.0830603 -0.0172677 0.1436146 -0.0235947 0.1039732 -0.0200319 -0.0755906 0.0235789 -0.0568075 -0.0744835 -0.058119 0.124408 -0.0679159 -0.087732 -0.0684756 -0.0455548 0.0088286 -0.0058017 -0.1106563 -0.0738446 0.0732495 -0.0474973 -0.0974609 -0.0427186 0.032152 0.0837411 0.0675694 0.0134449 0.0761965 -0.0146023 -0.0593899 0.0530758 -0.1033917 0.0173318 -0.0181344 -0.0473885 0.0794483 -0.0137394 0.0901545 0.0304995 0.0719819 0.025464 0.0689962 -0.1139521 -0.0781614 0.0196143 -0.0846156 0.1315651 -0.0086031 0.023691 -0.0084695 0.0925852 0.3744675 -0.0301877 -0.044434 -0.0010284 0.2227533 -0.0951532 -0.0687038 -0.1573493 0.2079787 unknown
polarizability: 133.7293701|10.5727228|103.9926559|4.5594089|7.9227833|121.0858469 unknown
InChI: InChI=1S/C11H12O3/c1-8(12)7-10(11(13)14)9-5-3-2-4-6-9/h2-6,10,13H,7H2,1H3
charge 0 multiplicity 1
26 atoms
O  0.818673 3.045969 -0.412309
O  1.544554 2.238989 1.637858
O  1.796442 -1.641738 -1.623822
C  0.925876 0.647899 -0.164749
C  1.859477 -0.404213 0.482607
C  -0.555398 0.248026 -0.041258
C  1.144735 2.012997 0.472143
C  2.025996 -1.657818 -0.38481
C  -1.218394 0.306716 1.212025
C  -1.261621 -0.218473 -1.176464
C  -2.56875 -0.091534 1.324274
C  -2.612063 -0.619715 -1.062393
C  2.498216 -2.914304 0.330567
C  -3.270204 -0.556265 0.187194
H  1.172744 0.723768 -1.237959
H  1.507922 -0.682933 1.492172
H  2.873918 0.023517 0.62977
H  -0.683342 0.674219 2.096891
H  -0.746531 -0.279881 -2.141263
H  -3.074116 -0.036309 2.295159
H  -3.147555 -0.981749 -1.947154
H  3.297746 -2.685836 1.05887
H  2.84754 -3.664496 -0.395514
H  1.6523 -3.342055 0.904249
H  -4.318186 -0.864281 0.274371
H  0.922321 3.921799 0.050648
