program: Gaussian 09
title: 000248427
version: EM64L-G09RevD.01
frameworkgroup: C1[X(C4H2Cl8S2)]
method: RPBEPBE
basis: SDD
operation: Freq
keyword: #p
keyword: freq=noraman
keyword: PBEPBE/SDD
title: #p freq=noraman PBEPBE/SDD
converged: YES YES NO NO
title: Mulliken charges:
elementType: Cl Cl Cl Cl Cl Cl Cl Cl S S C C C C H H
charge: 0.072660 0.072010 0.149157 0.116810 0.151853 0.151704 0.117228 0.148833 0.196677 0.194858 -0.558726 -0.556425 -0.507702 -0.509717 0.380547 0.380233
chargesum: 0.00000
title: Mulliken charges with hydrogens summed into heavy atoms:
elementType: Cl Cl Cl Cl Cl Cl Cl Cl S S C C C C
charge: 0.072660 0.072010 0.149157 0.116810 0.151853 0.151704 0.117228 0.148833 0.196677 0.194858 -0.178179 -0.176192 -0.507702 -0.509717
polarizability: 2.19582218e+02 -1.51929692e-01 1.39360726e+02 -2.27376738e+01 -2.03232435e-01 1.40080261e+02
1716.lowfreq: -1.7075 -0.0019 -0.0003 0.0005 3.3200 8.9918 19.3044 24.7236 26.9921
frequency: 19.2669 24.6006 26.9645 45.0643 56.6083 82.4214 125.8606 139.3885 146.4461 154.4704 172.2204 211.4307 214.3500 216.9917 218.8970 253.9063 261.4775 295.1044 297.0758 300.5455 304.3827 355.8091 362.1320 415.2138 541.1310 543.1444 634.5406 645.6665 664.5884 667.2566 721.6355 723.1064 743.0017 746.4120 1029.2578 1030.0867 1180.6162 1181.3907 1227.8009 1231.7180 3099.9811 3100.9867
redmass: 27.0463 28.4095 29.0200 29.5700 30.6678 23.4237 26.6350 28.1089 31.0500 32.0373 28.1678 27.9485 29.7830 29.2077 27.0142 27.2367 28.5572 27.5149 29.6480 18.9907 20.0230 28.5273 30.0248 29.7911 8.5912 8.4271 10.9763 10.7550 11.3134 12.0802 8.3205 7.9710 7.8591 8.0059 9.1125 9.1442 1.0702 1.0718 1.1631 1.1665 1.0871 1.0870
irintensity: 0.3539 0.0129 0.1613 0.0634 0.0259 0.0077 1.5803 0.4049 3.1789 0.0860 0.7948 1.0168 0.9661 0.0365 0.3746 0.0237 1.7712 0.5590 0.3117 4.8162 1.4118 0.0924 0.2781 3.2226 1.7370 70.5057 8.9749 115.8102 404.5225 3.8474 21.7487 25.3753 61.2966 84.8333 47.1067 11.5158 4.5094 2.4379 3.0184 15.6649 1.5514 24.1724
temp: 298.150 k
press: 1.00000 atm
elementType: 17 17 17 17 17 17 17 17 16 16 6 6 6 6 1 1
symmnumber: 1
zpe: 146021.9 jmol-1
zpe.correction: 0.055617 hartree
zpe.thermalcorrener: 0.074033 hartree
zpe.thermalcorrenthalpy: 0.074977 hartree
zpe.thermalcorrgfe: 0.004186 hartree
zpe.sumelectzpe: -4629.091165 hartree
zpe.sumelectthermal: -4629.072748 hartree
zpe.sumelectthermalent: -4629.071804 hartree
zpe.sumelectthermalfe: -4629.142595 hartree
dipole: 0.0224 0.7150 -0.0346
dipole: 0.7162
quadrupole: -157.0217 -154.1115 -152.4047
quadrupole: 0.0131 1.0344 0.0136
quadrupole: -2.5091 0.4012 2.1079 0.0131 1.0344 0.0136
hfenergy: -4629.1467813 hartree
pointgroup: C01 [X(C4H2Cl8S2)]
dipole: -0.0015682 0.0041554 0.2817386 debye
dipolederiv: -0.3358432 -0.239888 0.0045367 -0.3418836 -0.4965528 -0.1048336 -0.0444544 -0.1682668 -0.1592221 -0.3195656 -0.2218798 0.0261593 -0.323518 -0.467958 0.1569525 0.0910616 0.2204746 -0.2036825 -0.4993228 0.211689 -0.1735894 0.2148459 -0.2276554 0.1557071 -0.0891457 0.1239454 -0.3092987 -0.4441631 -0.2195225 -0.1198406 -0.2512804 -0.3892178 -0.1894979 -0.1166182 -0.1882 -0.2873957 -0.3081427 -0.1445338 0.2283115 -0.1693608 -0.2997556 0.2409203 0.3218648 0.2702542 -0.4754918 -0.3299193 -0.1854638 -0.2099696 -0.2201646 -0.3702314 -0.2462068 -0.2985657 -0.2770408 -0.3832232 -0.4130754 -0.1910219 0.1474939 -0.2206066 -0.349675 0.2136915 0.1463875 0.2103168 -0.3534019 -0.4978236 0.2211155 0.1617521 0.209668 -0.2550325 -0.1725992 0.0730956 -0.140013 -0.2904723 0.0850479 -0.1229936 -0.0178644 -0.1788272 -0.0879742 -0.0262638 0.2315721 0.0513561 -0.0363066 0.0929031 -0.1271024 0.0297604 -0.214547 -0.09929 0.0440765 -0.2087155 -0.0410587 -0.0270012 0.3203749 0.427249 -0.0651762 0.689476 0.5868911 0.1293404 -0.2374339 0.1823735 0.1616631 0.3013528 0.4132819 0.0138822 0.7084976 0.5616394 -0.210096 0.1454173 -0.2504999 0.1954023 1.1165946 0.092998 0.0923997 0.0904314 0.9095678 -0.1923614 0.0145724 -0.2644241 1.0962645 1.1041484 0.0984044 -0.1112152 0.0979922 0.9711345 0.1985711 -0.0268031 0.2703489 1.0526311 0.0603823 -0.0060976 0.0042417 -0.0414984 0.0046766 -0.0299677 0.0567941 -0.039215 0.0123863 0.0670517 -0.0062344 -0.0108822 -0.0492243 0.0094334 0.032567 -0.0590289 0.0396489 0.0071489 unknown
polarizability: 213.1140417|31.2669723|146.3882062|-3.3684925|-1.2717352|139.520957 unknown
InChI: InChI=1S/C4H2Cl8S2/c5-1(3(7,8)9)13-14-2(6)4(10,11)12/h1-2H
charge 0 multiplicity 1
16 atoms
Cl -2.828284 -2.215568 -0.951671
Cl 2.713928 2.075098 -1.334282
Cl -3.993897 0.972488 -0.227556
Cl -1.572481 1.290461 1.579746
Cl -3.474066 -0.990637 2.028579
Cl 3.556789 1.230529 1.727509
Cl 1.689152 -1.121391 1.667406
Cl 3.999766 -0.983549 -0.301027
S  -1.108921 0.26353 -1.633088
S  1.032011 -0.506549 -1.614887
C  -1.826221 -0.799631 -0.24028
C  1.791582 0.734154 -0.402996
C  -2.686251 0.052552 0.713306
C  2.723529 0.020951 0.595628
H  -0.991571 -1.259282 0.310247
H  0.975536 1.239645 0.134965
