program: Gaussian 09
title: 000248422
version: EM64L-G09RevD.01
frameworkgroup: C1[X(C7H14Cl2NO2PS)]
method: RPBEPBE
basis: SDD
operation: Freq
keyword: #p
keyword: freq=noraman
keyword: PBEPBE/SDD
title: #p freq=noraman PBEPBE/SDD
converged: YES YES NO NO
title: Mulliken charges:
elementType: Cl Cl S P O O N C C C C C C C H H H H H H H H H H H H H H
charge: -0.048830 -0.056229 0.039394 0.986756 -0.469449 -0.552359 -0.486829 -0.348153 -0.286135 -0.319586 -0.670964 -0.263526 -0.560321 -0.565723 0.218771 0.260855 0.264659 0.245193 0.273665 0.241854 0.256110 0.287400 0.243978 0.206209 0.270159 0.264416 0.305233 0.263452
chargesum: 0.00000
title: Mulliken charges with hydrogens summed into heavy atoms:
elementType: Cl Cl S P O O N C C C C C C C
charge: -0.048830 -0.056229 0.039394 0.986756 -0.469449 -0.552359 -0.486829 0.131473 0.223717 0.195933 -0.127454 0.186661 -0.025747 0.002963
polarizability: 1.73155846e+02 -8.07320419e+00 1.48002979e+02 3.57270702e+00 5.90530030e+00 1.28157264e+02
1716.lowfreq: -5.9779 -0.0030 -0.0006 0.0010 5.0412 8.7150 24.0122 35.3571 52.9531
frequency: 23.0206 35.3396 52.9345 59.9615 72.2582 92.7038 96.2055 121.6583 157.1264 190.9219 201.2842 214.0874 219.7703 238.4775 270.6925 293.6760 311.3445 333.7151 372.3413 393.5574 418.4841 481.7342 500.4788 584.9607 615.7995 649.5224 692.5432 698.5021 768.6224 776.9797 821.4030 847.0534 907.9920 930.9318 976.2721 995.4049 1027.1279 1038.7219 1045.5329 1047.4221 1062.5000 1080.6444 1104.6791 1163.7916 1186.5191 1206.5994 1227.6660 1251.4291 1255.6279 1259.9943 1290.6096 1293.3198 1323.2316 1346.0745 1353.1442 1361.9783 1367.2085 1429.9385 1432.5800 1445.4024 1455.0804 1460.1109 1465.7570 1470.1813 2980.3964 2986.0999 3004.8531 3018.9697 3024.4335 3060.6347 3064.0322 3064.5075 3074.2096 3084.1618 3090.6213 3100.6976 3148.6778 3151.3159
redmass: 7.4648 13.0784 7.0556 5.8201 2.8343 3.3554 2.4051 3.6346 5.7531 5.9300 3.6924 8.3809 4.4072 9.2045 4.7607 5.3965 3.7560 2.6434 5.0277 5.7151 6.0347 2.3477 4.8399 5.3784 8.0120 7.8384 5.4868 4.7316 1.1694 1.1858 2.5672 1.5655 2.6813 3.1452 2.8660 1.5251 2.5063 5.4054 2.4236 1.6899 2.9051 2.2914 2.0009 1.2132 1.8321 1.2091 1.5844 1.1668 1.1637 1.1530 1.1351 1.1847 1.1593 1.2151 1.3318 1.3307 1.2540 1.0840 1.0907 1.0858 1.0853 1.0876 1.0959 1.0720 1.0645 1.0654 1.0621 1.0605 1.0586 1.0577 1.0573 1.0959 1.0999 1.1043 1.1003 1.1070 1.1117 1.1119
irintensity: 2.7460 0.4634 1.8216 3.6370 3.1777 1.0390 2.0682 1.3797 0.1425 0.8625 1.7842 6.2388 2.3684 5.7329 16.3305 0.3431 20.9883 5.3590 9.8581 23.8611 38.5693 10.8301 47.2584 5.1789 57.5261 33.9614 107.8278 135.8692 3.8467 17.3166 13.5639 11.5434 27.2799 103.6104 95.0496 2.7058 7.2246 76.1116 29.6978 2.7261 15.7501 3.6204 58.5198 2.0317 39.4942 2.9663 4.4828 15.3409 1.2754 6.1826 4.6585 9.0053 5.0805 3.5635 2.7104 4.0125 0.9310 18.9177 7.0782 9.9209 9.9800 8.1630 19.1270 13.9056 27.2655 33.3588 16.5184 9.0358 18.5617 15.3453 12.4786 12.6560 2.0471 5.0971 15.9868 15.0302 13.3616 8.5058
temp: 298.150 k
press: 1.00000 atm
elementType: 17 17 16 15 8 8 7 6 6 6 6 6 6 6 1 1 1 1 1 1 1 1 1 1 1 1 1 1
symmnumber: 1
zpe: 560595.5 jmol-1
zpe.correction: 0.213520 hartree
zpe.thermalcorrener: 0.230743 hartree
zpe.thermalcorrenthalpy: 0.231687 hartree
zpe.thermalcorrgfe: 0.165740 hartree
zpe.sumelectzpe: -2138.598764 hartree
zpe.sumelectthermal: -2138.581541 hartree
zpe.sumelectthermalent: -2138.580597 hartree
zpe.sumelectthermalfe: -2138.646544 hartree
dipole: -3.4093 0.8319 -5.2695
dipole: 6.3312
quadrupole: -114.5741 -131.1526 -115.8575
quadrupole: 6.4685 10.5454 9.1097
quadrupole: 5.9540 -10.6245 4.6706 6.4685 10.5454 9.1097
hfenergy: -2138.8122836 hartree
pointgroup: C01 [X(C7H14Cl2N1O2P1S1)]
dipole: -1.1598971 0.7862835 -2.0593297 debye
polarizability: 159.3009329|-13.9767267|163.3839265|4.4577111|0.6069663|126.6312285 unknown
InChI: InChI=1S/C7H14Cl2NO2PS/c8-2-4-10(5-3-9)13(11)12-6-1-7-14/h1-7H2
charge 0 multiplicity 1
28 atoms
Cl 2.56939 3.534777 -0.713288
Cl 3.144344 -3.322685 -0.34294
S  -1.962675 1.570421 1.15924
P  -0.775464 -0.391837 1.087215
O  -1.693142 -1.457907 0.062512
O  -0.518793 -1.055355 2.508205
N  0.61773 -0.033856 0.060883
C  -3.261929 0.186001 -1.036712
C  1.413821 1.197398 0.303396
C  1.344888 -1.199261 -0.519035
C  -2.638039 1.53159 -0.633635
C  -2.240233 -0.947743 -1.223909
C  1.404013 2.069844 -0.959914
C  2.162502 -1.96872 0.537062
H  -3.777805 0.328776 -2.008497
H  -4.026281 -0.119836 -0.299735
H  0.987922 1.769809 1.145779
H  2.455096 0.940883 0.57511
H  0.620659 -1.886393 -0.989224
H  2.015621 -0.824603 -1.313067
H  -1.816612 1.812543 -1.314292
H  -3.389936 2.338626 -0.627275
H  -2.714157 -1.840714 -1.662013
H  -1.404924 -0.61641 -1.87471
H  0.411795 2.501965 -1.151721
H  1.778642 1.535591 -1.845848
H  1.524349 -2.477595 1.273822
H  2.909219 -1.339408 1.043291
