program: Gaussian 09
title: 000020125
version: EM64L-G09RevD.01
frameworkgroup: C1[X(C8H17NO)]
method: RPBEPBE
basis: SDD
operation: Freq
keyword: #p
keyword: freq=noraman
keyword: PBEPBE/SDD
title: #p freq=noraman PBEPBE/SDD
converged: YES YES NO NO
title: Mulliken charges:
elementType: O N C C C C C C C C H H H H H H H H H H H H H H H H H
charge: -0.258875 -0.603990 -0.139808 -0.409826 -0.340929 -0.383489 -0.353890 0.156089 -0.692970 -0.697611 0.229504 0.175465 0.200726 0.209664 0.195620 0.179667 0.207733 0.190927 0.193085 0.219346 0.210685 0.233260 0.214369 0.212635 0.212965 0.331174 0.308474
chargesum: 0.00000
title: Mulliken charges with hydrogens summed into heavy atoms:
elementType: O N C C C C C C C C
charge: -0.258875 0.035657 0.089696 -0.033635 0.064355 0.003911 0.030122 0.156089 -0.029678 -0.057643
polarizability: 1.06058173e+02 7.30530841e-01 9.17937506e+01 4.19836957e-01 -1.89176117e+00 8.91029625e+01
1716.lowfreq: -13.4233 -4.8898 0.0006 0.0007 0.0008 15.2949 30.6107 45.9515 67.6610
frequency: 30.1761 45.5064 67.5176 82.5650 106.4645 121.7366 179.7266 221.7155 228.4354 242.3730 286.4481 294.5811 412.4152 424.9901 491.6033 503.6809 523.9027 582.2553 711.4518 725.0846 733.6026 779.5894 827.6438 884.2621 911.4540 937.2717 992.4892 1027.4666 1036.9619 1048.8099 1070.7829 1083.4116 1101.2594 1115.7624 1144.1322 1203.9357 1233.7459 1252.7198 1267.3458 1288.4563 1291.8672 1317.4934 1324.7543 1330.2407 1351.0526 1362.8372 1390.4369 1394.7301 1457.7470 1465.5470 1469.6570 1475.3638 1476.9185 1477.7973 1483.3036 1487.1234 1586.1108 1636.0633 2947.6857 2960.2632 2961.5249 2971.7322 2974.5672 2981.9645 2994.1706 3003.2952 3007.9199 3026.5674 3040.4621 3071.1263 3073.3480 3078.6693 3080.3198 3516.8153 3672.6466
redmass: 5.0031 2.6244 1.8304 2.9849 2.5933 2.3096 1.6092 1.7959 1.5236 1.4087 2.3844 3.6093 2.6856 3.4805 1.1821 2.9762 2.4732 1.2194 1.6216 1.9707 1.4747 1.3726 1.4497 1.9685 1.4419 1.4759 3.7691 1.5306 1.5489 3.1114 1.9918 2.0500 2.1858 1.7934 2.6158 1.5269 1.3446 1.2483 1.2729 1.1552 1.1416 1.4972 1.4555 1.4530 1.9065 1.8629 1.2158 1.2103 1.0781 1.0750 1.0824 1.0415 1.0669 1.0486 1.0660 1.0800 1.5550 3.0205 1.0612 1.0589 1.0611 1.0597 1.0363 1.0360 1.0949 1.0953 1.0971 1.0955 1.1021 1.1005 1.0995 1.0999 1.1002 1.0442 1.1042
irintensity: 12.6079 1.0573 0.2246 0.2614 0.3735 0.1004 0.0114 0.8937 0.0234 0.0153 4.8595 0.0214 0.1996 1.9788 206.1875 11.4141 3.2305 75.5076 17.5611 17.3923 1.5869 3.4201 1.3151 4.8150 3.6947 6.0954 0.4687 1.5865 1.0133 0.4539 11.7118 4.8152 2.3184 9.6433 3.6325 2.9715 7.7454 1.4510 4.6512 1.0113 0.2690 18.9773 16.6583 1.6280 31.3021 22.4668 11.0795 13.0045 0.2828 0.0574 5.0599 10.4951 3.3333 12.7671 7.0132 15.0371 70.0504 269.9944 10.7798 9.5832 46.4516 64.9159 42.2596 27.4894 12.5440 6.5016 8.3490 7.1925 84.8933 78.9094 53.0235 43.2882 53.2600 21.1976 21.8384
temp: 298.150 k
press: 1.00000 atm
elementType: 8 7 6 6 6 6 6 6 6 6 1 1 1 1 1 1 1 1 1 1 1 1 1 1 1 1 1
symmnumber: 1
zpe: 630227.8 jmol-1
zpe.correction: 0.240041 hartree
zpe.thermalcorrener: 0.253064 hartree
zpe.thermalcorrenthalpy: 0.254008 hartree
zpe.thermalcorrgfe: 0.199607 hartree
zpe.sumelectzpe: -444.213145 hartree
zpe.sumelectthermal: -444.200122 hartree
zpe.sumelectthermalent: -444.199178 hartree
zpe.sumelectthermalfe: -444.253579 hartree
dipole: 0.4126 -2.1753 3.3873
dipole: 4.0467
quadrupole: -64.7678 -66.2285 -61.4964
quadrupole: 2.3817 -4.7125 7.9636
quadrupole: -0.6036 -2.0642 2.6678 2.3817 -4.7125 7.9636
hfenergy: -444.453186 hartree
pointgroup: C01 [X(C8H17N1O1)]
dipole: -0.1823315 -0.8375471 -1.3416497 debye
polarizability: 106.0057905|-1.1255355|91.8054428|0.4993159|1.9044616|89.1436525 unknown
InChI: InChI=1S/C8H17NO/c1-3-5-6-7(4-2)8(9)10/h7H,3-6,9H2,1-2H3
charge 0 multiplicity 1
27 atoms
O  1.279407 1.821196 1.008439
N  1.222574 1.387362 -1.263924
C  0.817003 -0.500029 0.298558
C  -0.564087 -0.913214 -0.286209
C  -1.752251 -0.090546 0.258959
C  1.95617 -1.416013 -0.234329
C  -3.114861 -0.559866 -0.299364
C  1.121978 0.991151 0.063855
C  3.339018 -1.105958 0.375887
C  -4.301805 0.26083 0.249446
H  0.775363 -0.60185 1.400131
H  -0.543442 -0.842035 -1.3952
H  -0.725013 -1.986202 -0.053929
H  -1.606191 0.981445 0.01683
H  -1.765006 -0.155566 1.366151
H  2.010546 -1.34272 -1.340866
H  1.678903 -2.466112 -0.011817
H  -3.098407 -0.493186 -1.40687
H  -3.2609 -1.632326 -0.055493
H  3.312303 -1.194699 1.477381
H  4.106502 -1.803869 -0.005298
H  3.663694 -0.077533 0.135103
H  -5.264892 -0.091523 -0.163393
H  -4.194702 1.331651 -0.006532
H  -4.358027 0.186075 1.351662
H  1.425483 2.366098 -1.464997
H  1.096739 0.735237 -2.035779
