program: Gaussian 09
title: 000248423
version: EM64L-G09RevD.01
frameworkgroup: C1[X(C10H20N3OP)]
method: RPBEPBE
basis: SDD
operation: Freq
keyword: #p
keyword: freq=noraman
keyword: PBEPBE/SDD
title: #p freq=noraman PBEPBE/SDD
converged: YES YES NO NO
title: Mulliken charges:
elementType: P O N N N C C C C C C C C C C H H H H H H H H H H H H H H H H H H H H
charge: 1.203613 -0.631418 -0.401591 -0.409483 -0.799309 -0.401152 -0.378421 -0.392552 -0.387742 0.044585 -0.422365 -0.408222 -0.389381 -0.390484 -0.387038 0.264618 0.245153 0.245148 0.246435 0.245379 0.260615 0.252068 0.245528 0.248096 0.323667 0.176901 0.217769 0.228260 0.175444 0.198050 0.196273 0.196922 0.197712 0.199506 0.187416
chargesum: 0.00000
title: Mulliken charges with hydrogens summed into heavy atoms:
elementType: P O N N N C C C C C C C C C C
charge: 1.203613 -0.631418 -0.401591 -0.409483 -0.475641 0.108619 0.113162 0.113442 0.109855 0.292680 -0.027695 -0.004518 0.004941 0.004150 -0.000115
polarizability: 1.68794847e+02 1.25190418e+00 1.54223108e+02 -4.30659946e+00 7.26888629e-02 1.26137177e+02
1716.lowfreq: -11.5313 -7.3675 -0.0014 -0.0004 0.0014 10.9443 15.8552 31.8848 42.2634
frequency: 13.8178 31.7344 42.0122 59.6424 61.7074 121.8286 128.9333 137.9193 181.0323 188.0570 216.8715 238.6503 254.3316 307.3134 340.2273 363.5179 382.7831 393.7635 411.2551 424.2711 444.1484 482.8264 505.4949 543.7641 604.1256 780.6465 788.1896 793.4168 805.2299 808.6088 811.6573 831.1365 866.0019 884.7919 886.7354 891.9729 897.1701 915.9481 981.5083 991.1294 997.2736 999.0904 1044.2482 1053.7784 1066.7894 1071.4777 1075.0976 1104.5441 1109.1161 1111.2608 1116.9085 1118.4575 1121.7354 1143.2027 1148.5243 1152.9999 1192.9572 1233.4929 1233.9582 1241.1329 1251.9914 1255.0274 1295.7451 1302.6694 1326.6525 1334.6940 1339.2441 1341.5796 1351.0240 1411.2127 1445.4917 1447.1479 1456.7154 1460.3297 1461.8868 1463.8969 1464.1693 1469.0017 1476.4494 2955.0290 2960.9685 2965.5796 2969.0365 2969.1103 3008.7220 3028.0086 3028.7199 3037.7163 3041.0300 3050.9314 3070.5350 3071.6938 3076.3561 3078.3442 3179.0300 3180.2685 3196.1006 3197.3110 3559.6258
redmass: 2.9662 4.1764 2.8224 3.3706 4.0649 2.7068 3.6183 4.1523 4.1596 3.9170 1.7731 6.7257 2.4259 1.9618 4.4474 3.7043 2.1689 2.0051 2.2080 4.0551 3.3817 3.6264 3.1260 2.5004 9.7469 1.4885 2.2010 8.7468 8.7239 1.1037 1.1630 2.4021 3.3841 4.4375 1.8047 1.7279 2.9562 1.8668 3.5939 1.0633 1.3798 2.4772 1.7539 1.1288 1.2473 1.3625 1.2893 3.5498 1.3451 2.4861 1.3099 1.3128 1.3349 2.3161 1.3856 1.3846 1.5230 2.3850 1.6916 3.0334 1.2620 1.2858 1.2263 1.2881 1.4356 1.3775 1.4595 1.4552 1.4174 1.3137 1.0757 1.0758 1.0890 1.1751 1.0923 1.1737 1.0889 1.0804 1.0963 1.0656 1.0656 1.0629 1.0622 1.0625 1.0836 1.0960 1.0979 1.1001 1.0990 1.1004 1.0489 1.0486 1.0604 1.0607 1.1175 1.1177 1.1176 1.1176 1.0758
irintensity: 0.0252 0.0354 0.8444 2.2557 1.6124 1.7732 1.6291 2.8183 16.5701 11.7269 1.0556 5.4171 8.0956 0.8583 0.6095 0.2498 5.6616 63.3199 0.4106 16.4479 5.9050 7.1172 24.3008 17.2608 117.4248 0.5516 0.8263 2.9468 14.9190 38.0726 6.0082 16.4005 22.9575 196.8511 4.3294 43.1086 166.4400 0.6559 16.8672 0.7181 16.6092 45.6427 0.6376 1.2124 3.5139 2.4235 0.8717 158.5772 7.2621 1.4288 7.1884 16.9933 2.0378 13.5117 0.2112 0.1002 2.0526 55.6325 34.0695 24.7960 5.1157 2.3287 28.7152 1.9743 0.5115 0.0407 0.3234 1.1824 1.0822 41.0693 4.7422 8.3822 4.5549 1.2443 3.1371 2.8624 9.5231 22.3708 4.8302 22.3092 34.7879 40.0064 32.0513 29.7149 11.1094 72.5594 71.1740 30.7117 29.6903 89.0257 5.9467 22.7085 42.6893 20.7342 0.5267 2.1164 10.5780 18.4781 27.5474
temp: 298.150 k
press: 1.00000 atm
elementType: 15 8 7 7 7 6 6 6 6 6 6 6 6 6 6 1 1 1 1 1 1 1 1 1 1 1 1 1 1 1 1 1 1 1 1
symmnumber: 1
zpe: 778345.8 jmol-1
zpe.correction: 0.296456 hartree
zpe.thermalcorrener: 0.313313 hartree
zpe.thermalcorrenthalpy: 0.314257 hartree
zpe.thermalcorrgfe: 0.249768 hartree
zpe.sumelectzpe: -972.461624 hartree
zpe.sumelectthermal: -972.444768 hartree
zpe.sumelectthermalent: -972.443824 hartree
zpe.sumelectthermalfe: -972.508312 hartree
dipole: -1.1154 0.0675 -1.3426
dipole: 1.7468
quadrupole: -96.5327 -90.9737 -102.4751
quadrupole: 0.5800 -10.8830 0.8776
quadrupole: 0.1278 5.6868 -5.8146 0.5800 -10.8830 0.8776
hfenergy: -972.7580806 hartree
pointgroup: C01[X(C10H20N3O1P1)]
dipole: 0.4253277 -0.0027818 -0.5397938 debye
polarizability: 168.9785755|1.1590119|154.1895181|3.2677799|1.0839355|125.9870384 unknown
InChI: InChI=1S/C10H20N3OP/c14-15(12-6-7-12,13-8-9-13)11-10-4-2-1-3-5-10/h10-11H,1-9H2
charge 0 multiplicity 1
35 atoms
P  -1.437077 -0.016855 0.628926
O  -2.492894 -0.030989 1.846363
N  -1.491401 -1.415169 -0.497751
N  -1.579497 1.317885 -0.559239
N  0.194811 0.076517 1.138634
C  -1.969449 -2.732868 0.083538
C  -2.850331 -1.966463 -0.885078
C  -1.994686 2.668635 -0.010995
C  -2.966709 1.858754 -0.848923
C  1.370894 0.07887 0.239902
C  2.343486 1.222597 0.621819
C  2.100076 -1.289569 0.236372
C  3.583262 1.242702 -0.304799
C  3.336803 -1.266999 -0.693718
C  4.308744 -0.1244 -0.31263
H  -2.283371 -2.742876 1.135273
H  -1.404487 -3.604388 -0.260006
H  -2.923005 -2.279038 -1.931018
H  -3.744764 -1.489539 -0.464366
H  -1.459019 3.513246 -0.454056
H  -2.208144 2.743411 1.06295
H  -3.816155 1.411016 -0.317215
H  -3.13774 2.115375 -1.898476
H  0.987156 0.27147 -0.780827
H  0.358975 0.007433 2.144666
H  2.673379 1.077131 1.673131
H  1.80435 2.187429 0.579554
H  1.385102 -2.071793 -0.07965
H  2.419539 -1.529116 1.273063
H  4.276948 2.045211 0.01293
H  3.260887 1.489667 -1.337518
H  3.000154 -1.124745 -1.74155
H  3.856406 -2.243989 -0.655802
H  5.164767 -0.098133 -1.014568
H  4.726189 -0.321623 0.696865
