program: Gaussian 09
title: 000248417
version: EM64L-G09RevD.01
frameworkgroup: C1[X(C19H31NO2)]
method: RPBEPBE
basis: SDD
operation: Freq
keyword: #p
keyword: freq=noraman
keyword: PBEPBE/SDD
title: #p freq=noraman PBEPBE/SDD
converged: YES YES NO NO
title: Mulliken charges:
elementType: O O N C C C C C C C C C C C C C C C C C C C H H H H H H H H H H H H H H H H H H H H H H H H H H H H H H H
charge: -0.207838 -0.210202 0.085718 -0.114951 -0.115706 -0.137938 0.391872 0.420271 -0.015408 -0.540191 -0.524822 -0.503457 -0.205014 -0.555465 -0.496337 -0.514776 -0.461781 -0.479843 -0.823506 -0.866118 -0.423839 -0.406172 0.186197 0.235921 0.213599 0.182009 0.222517 0.222106 0.198565 0.236957 0.215015 0.199017 0.284222 0.220343 0.234288 0.192654 0.207747 0.199878 0.208974 0.261177 0.223707 0.198112 0.191106 0.235697 0.232813 0.243096 0.220823 0.224836 0.221001 0.195845 0.204815 0.202941 0.189525
chargesum: 0.00000
title: Mulliken charges with hydrogens summed into heavy atoms:
elementType: O O N C C C C C C C C C C C C C C C C C C C
charge: -0.207838 -0.210202 0.085718 0.071247 0.120215 0.075661 0.391872 0.420271 0.166601 -0.095567 -0.089300 -0.089425 0.079208 -0.100835 -0.095937 -0.105924 0.023103 -0.090625 -0.111900 -0.199458 -0.023179 -0.013706
polarizability: 2.57252343e+02 -5.12243715e-01 2.00279242e+02 -4.27766026e+00 3.89804307e+00 1.67125056e+02
1716.lowfreq: -12.7282 -4.6849 0.0004 0.0006 0.0007 4.5815 39.2878 46.3377 62.6651
frequency: 39.1560 46.3035 62.6458 89.3061 100.5475 129.5425 149.0188 166.8223 179.7982 203.9527 211.7554 229.0183 251.1666 260.5430 271.0946 278.9396 297.2337 314.2604 320.5780 333.0155 350.3374 382.1041 400.5109 409.1120 420.1709 431.0069 440.3378 472.0957 501.7539 505.7013 527.4972 539.1208 560.0608 587.8076 639.9132 658.9464 704.5703 714.0040 734.3831 791.7891 801.4643 817.2640 823.5800 836.3901 842.4545 852.9523 876.4578 895.9326 914.6057 916.3214 927.8399 941.7043 956.6215 960.6893 977.3575 990.9415 1000.3377 1002.1719 1009.0997 1029.1884 1041.9097 1044.1467 1061.7221 1075.5213 1080.3632 1089.0052 1100.8138 1110.4270 1121.7377 1124.0537 1127.4519 1137.8082 1155.2332 1164.4105 1171.7032 1185.7344 1192.9438 1204.4626 1209.0118 1221.0334 1224.9297 1244.1153 1244.9799 1251.1246 1258.4063 1262.2525 1266.6424 1279.7014 1287.3370 1289.3818 1301.1702 1303.8627 1310.3072 1319.1555 1323.3187 1329.1479 1331.6821 1333.2307 1337.7059 1340.2198 1342.5526 1351.6325 1352.3009 1357.3029 1365.7646 1391.3838 1403.9110 1415.8551 1458.1757 1459.9014 1461.4201 1465.0979 1465.9222 1468.9130 1471.1252 1474.4922 1482.2193 1482.7945 1490.3458 1492.5251 1497.0369 1499.3636 2896.2690 2906.4036 2909.2017 2946.3658 2948.0749 2961.3579 2963.8172 2964.9802 2969.8362 2971.7946 2973.1919 2986.0527 2990.9284 2995.1858 2999.7879 3012.5330 3016.8664 3019.1369 3023.6164 3024.4793 3026.5766 3033.2361 3038.0152 3044.8573 3047.6690 3062.0688 3073.8645 3082.0229 3086.8773 3093.0069 3099.8789
redmass: 4.1784 6.6429 5.5466 3.1381 4.9586 2.2156 1.6476 2.7260 2.2849 2.2661 2.7300 1.5753 2.5657 1.6069 2.2587 2.2875 2.7638 2.9365 2.5738 2.1462 2.5424 3.2904 3.1433 2.4895 3.6977 3.2829 3.9226 2.3276 3.5849 2.4124 2.5084 1.9575 2.7103 2.8564 3.1992 3.1268 5.2616 2.8769 2.9240 1.7714 2.2607 2.4209 1.8180 1.8914 1.9376 2.1672 1.9159 1.6852 2.2065 2.0895 1.8740 2.1220 1.6787 2.2331 1.8603 2.1689 1.9745 1.9902 1.7892 1.7763 1.8560 2.5571 2.0708 2.1538 2.0579 1.8532 1.6563 1.5343 2.3648 1.9954 1.9817 1.7786 1.7383 1.8369 1.7800 2.4971 2.0680 1.6774 1.2716 2.4329 1.7320 1.3352 1.5561 1.4693 1.5605 1.3503 1.3191 1.7673 1.4021 1.3311 1.2775 1.6008 1.4550 1.4027 1.4497 1.4225 1.3543 1.3768 1.4611 1.4689 1.4495 1.5648 1.4083 1.4317 1.4824 1.2108 1.1970 3.3800 1.0808 1.0874 1.0896 1.0893 1.0789 1.0879 1.0809 1.0797 1.0874 1.0853 1.0621 1.0798 1.0575 1.0606 1.0816 1.0805 1.0804 1.0643 1.0629 1.0610 1.0635 1.0618 1.0629 1.0786 1.0631 1.0557 1.0428 1.0415 1.0610 1.0984 1.0967 1.0952 1.0997 1.0646 1.1012 1.0957 1.1024 1.1004 1.0862 1.0998 1.0972 1.0975 1.0967 1.1022 1.0988
irintensity: 0.1832 1.3619 0.6038 0.7356 1.9434 0.0985 0.0485 1.1108 0.3539 0.6587 0.2267 0.3338 0.5317 0.0641 0.1054 0.1329 0.3764 0.9892 0.1918 0.4542 0.3182 0.2777 0.2314 0.0617 1.6448 0.4581 1.1950 0.8383 0.8558 0.9528 1.8153 0.0868 1.7935 2.1346 0.3887 5.9505 5.7903 0.8733 16.5187 1.7793 0.0311 3.9395 4.7375 2.2564 2.2529 2.5824 1.1251 6.5654 1.1644 2.9931 3.3426 3.8869 7.8569 11.7492 3.0773 0.6793 0.8932 1.5264 0.7756 1.7265 5.0902 4.0831 1.5947 8.6441 2.3958 0.9247 0.4982 0.8404 3.4339 0.5184 19.0778 1.3053 4.7478 3.3238 9.4165 27.3643 22.1326 2.1790 2.7105 66.6538 3.0330 1.4395 4.2951 4.0600 4.6749 5.6265 12.0614 1.3080 2.4702 4.5299 1.9271 35.2980 4.5836 0.3045 6.9318 0.2395 1.2051 0.5679 2.5012 1.3468 1.0114 0.4994 0.5953 0.5967 4.6174 22.4645 31.5606 92.4133 2.5352 4.8946 2.7645 6.3747 9.8489 20.7304 11.7215 11.5506 5.3221 0.8335 9.5913 11.6205 3.1549 7.9427 1.9427 1.4924 45.6871 22.8631 37.9533 29.1866 24.9184 8.3557 85.0083 28.7386 37.2012 8.1374 23.4568 17.8054 23.5701 15.9827 96.4750 12.6005 74.2045 23.6534 42.9262 30.6418 130.1385 39.6531 17.8790 27.4663 29.1440 19.5455 46.2131 26.3247 19.2539
temp: 298.150 k
press: 1.00000 atm
elementType: 8 8 7 6 6 6 6 6 6 6 6 6 6 6 6 6 6 6 6 6 6 6 1 1 1 1 1 1 1 1 1 1 1 1 1 1 1 1 1 1 1 1 1 1 1 1 1 1 1 1 1 1 1
symmnumber: 1
zpe: 1234279.7 jmol-1
zpe.correction: 0.470112 hartree
zpe.thermalcorrener: 0.490668 hartree
zpe.thermalcorrenthalpy: 0.491612 hartree
zpe.thermalcorrgfe: 0.422764 hartree
zpe.sumelectzpe: -946.021143 hartree
zpe.sumelectthermal: -946.000587 hartree
zpe.sumelectthermalent: -945.999643 hartree
zpe.sumelectthermalfe: -946.068491 hartree
dipole: 4.2790 2.3035 -0.8762
dipole: 4.9380
quadrupole: -163.8052 -137.7963 -133.1928
quadrupole: -12.0621 4.0304 -2.2655
quadrupole: -18.8738 7.1351 11.7386 -12.0621 4.0304 -2.2655
hfenergy: -946.4912549 hartree
pointgroup: C01 [X(C19H31N1O2)]
dipole: -1.6838698 -0.9076536 -0.3391856 debye
polarizability: 257.2577301|-0.5032221|200.2404808|4.2206544|-4.0603757|167.1584304 unknown
InChI: InChI=1S/C19H31NO2/c1-18-11-4-3-5-13(18)6-7-14-15-8-9-17(20(21)22)19(15,2)12-10-16(14)18/h13-17H,3-12H2,1-2H3
charge 0 multiplicity 1
53 atoms
O  4.682685 1.907356 -0.699376
O  5.364434 0.263877 0.721331
N  4.57998 0.726228 -0.188602
C  -0.933593 0.367395 -0.270318
C  -0.2167 -0.94056 0.21045
C  1.214777 -0.96482 -0.366535
C  2.065251 0.28022 0.051827
C  -2.428221 0.451936 0.231288
C  -3.164776 -0.842709 -0.278665
C  -0.088613 1.637907 0.03793
C  1.370243 1.549896 -0.486748
C  -1.01093 -2.201619 -0.212096
C  3.40164 -0.116171 -0.673124
C  2.143559 -2.171632 -0.076829
C  -2.489511 -2.136808 0.227343
C  -3.137924 1.68107 -0.424261
C  3.574192 -1.643053 -0.438422
C  -4.686835 -0.820634 0.002088
C  2.299946 0.378825 1.58238
C  -2.49297 0.586844 1.778505
C  -4.666602 1.723777 -0.180465
C  -5.359063 0.417912 -0.634039
H  -0.992664 0.288614 -1.383054
H  -0.152555 -0.934531 1.318711
H  1.101731 -0.90259 -1.475114
H  -3.048542 -0.834143 -1.388673
H  -0.073029 1.829219 1.127893
H  -0.567512 2.520986 -0.423628
H  1.357676 1.515258 -1.596368
H  1.931766 2.460287 -0.202964
H  -0.526368 -3.106019 0.204906
H  -0.967103 -2.296976 -1.318794
H  3.316547 0.142805 -1.743026
H  1.873939 -3.060705 -0.672046
H  2.087041 -2.463207 0.988726
H  -3.037569 -3.015916 -0.167737
H  -2.560489 -2.196496 1.332294
H  -2.951875 1.651543 -1.519721
H  -2.688442 2.621605 -0.050662
H  4.299779 -1.816301 0.373499
H  3.973581 -2.126887 -1.346275
H  -4.876689 -0.832938 1.094724
H  -5.141656 -1.747937 -0.401339
H  2.876814 1.289537 1.826483
H  1.345517 0.437948 2.129614
H  2.862745 -0.484011 1.977363
H  -2.070193 1.554507 2.105203
H  -3.532647 0.547002 2.14549
H  -1.934745 -0.213197 2.295227
H  -5.09941 2.589647 -0.719198
H  -4.870852 1.89447 0.895516
H  -6.437068 0.447385 -0.382031
H  -5.2905 0.335608 -1.73908
