program: Gaussian 09
title: 000248355
version: EM64L-G09RevD.01
frameworkgroup: C1[X(C9H12O2S)]
method: RPBEPBE
basis: SDD
operation: Freq
keyword: #p
keyword: freq=noraman
keyword: PBEPBE/SDD
title: #p freq=noraman PBEPBE/SDD
converged: NO YES NO NO
title: Mulliken charges:
elementType: S O O C C C C C C C C C H H H H H H H H H H H H
charge: 0.941887 -0.568920 -0.568919 -0.765596 -0.504665 0.517419 -0.640656 -0.346449 -0.346454 -0.218014 -0.218012 -0.227302 0.262665 0.262671 0.250773 0.250775 0.228063 0.257720 0.257721 0.240505 0.240509 0.230955 0.230955 0.232370
chargesum: 0.00000
title: Mulliken charges with hydrogens summed into heavy atoms:
elementType: S O O C C C C C C C C C
charge: 0.941887 -0.568920 -0.568919 -0.240260 -0.003117 0.517419 0.102847 -0.105943 -0.105945 0.012941 0.012943 0.005067
polarizability: 2.00103512e+02 1.75533260e-05 1.22166043e+02 1.42672506e+01 3.79052091e-05 8.77364085e+01
1716.lowfreq: -7.9398 -0.0027 -0.0024 -0.0014 4.3533 7.9025 24.6300 33.2641 45.1160
frequency: 22.1501 31.8452 44.5272 57.6476 119.5578 185.8154 188.8218 199.6363 227.2600 270.0758 314.4046 340.1238 366.9573 401.2114 474.0647 505.3059 532.5177 582.1261 616.2274 692.7114 769.0933 781.7535 796.5898 813.9139 844.8035 857.5870 925.0125 925.0484 974.9420 976.6813 989.1296 998.9153 1027.3690 1027.9304 1064.5327 1076.7588 1121.1087 1173.0615 1176.0355 1193.7122 1234.5269 1238.8837 1245.9769 1331.2038 1389.9070 1396.6001 1412.4994 1426.4637 1443.7710 1464.5450 1483.3630 1485.2605 1590.5487 1612.2442 2991.8411 3039.4478 3051.3708 3085.3904 3101.1049 3129.3813 3134.4870 3135.4016 3142.8638 3145.1473 3156.4148 3169.8942
redmass: 4.1773 3.2321 3.3394 4.9413 5.1693 5.8982 3.6902 1.7694 4.1004 1.8903 8.2014 2.0602 4.4627 2.7610 4.2913 7.1920 5.5559 4.7803 6.2992 1.6930 2.0663 1.2126 9.5426 4.2731 1.2827 2.0570 2.5100 1.4406 1.5259 1.3984 5.4811 1.3699 2.1905 1.3133 2.6539 1.5322 1.1718 1.1751 1.0528 1.1114 2.8671 1.2490 1.2564 1.2725 8.8725 1.1680 1.1278 1.1637 2.2276 1.0344 1.0508 2.3407 5.9585 6.0167 1.0362 1.0562 1.0563 1.0975 1.1019 1.0849 1.1096 1.0888 1.1113 1.0928 1.0971 1.1018
irintensity: 3.1296 0.0906 0.9853 4.2487 3.3028 12.4260 0.0191 0.5836 16.1452 0.8208 13.8569 0.1133 11.3144 0.0125 27.9012 47.3060 3.3794 14.9296 0.0053 51.3626 14.8349 1.6531 68.0791 12.4329 0.0123 22.1244 53.7791 2.0250 26.7423 0.1082 0.4301 0.0283 4.8201 1.7681 13.7246 16.9443 0.5313 21.5032 0.0000 0.1926 12.6042 0.7149 17.3972 0.4436 1.2864 28.7854 0.0359 5.7053 12.0383 19.9466 13.1624 7.6671 0.6364 1.9482 20.8215 8.9699 16.4438 9.5078 2.7989 0.9399 7.7640 1.2338 2.1108 17.4350 28.8095 19.4392
temp: 298.150 k
press: 1.00000 atm
elementType: 16 8 8 6 6 6 6 6 6 6 6 6 1 1 1 1 1 1 1 1 1 1 1 1
symmnumber: 1
zpe: 494808.4 jmol-1
zpe.correction: 0.188463 hartree
zpe.thermalcorrener: 0.201676 hartree
zpe.thermalcorrenthalpy: 0.202620 hartree
zpe.thermalcorrgfe: 0.146470 hartree
zpe.sumelectzpe: -897.601445 hartree
zpe.sumelectthermal: -897.588232 hartree
zpe.sumelectthermalent: -897.587288 hartree
zpe.sumelectthermalfe: -897.643438 hartree
dipole: 0.3127 -0.0003 4.8080
dipole: 4.8182
quadrupole: -61.0921 -80.6381 -82.7833
quadrupole: -0.0009 10.3797 -0.0002
quadrupole: 13.7457 -5.8003 -7.9454 -0.0009 10.3797 -0.0002
hfenergy: -897.7899075 hartree
pointgroup: C01 [X(C9H12O2S1)]
dipole: 0.1347615 -0.0003134 1.8908142 debye
dipolederiv: 1.1341988 -0.0000002 -0.0119055 0.0000349 1.0814199 0. -0.2562271 -0.0000001 1.1023949 -0.6769836 -0.0318145 0.0144343 -0.0831325 -0.6229197 0.1480572 0.1451009 0.0429052 -0.5466548 -0.6769637 0.0318105 0.0144274 0.0830808 -0.6228642 -0.148081 0.1451165 -0.0429349 -0.5467079 0.4833117 -0.0000106 0.0346009 -0.0000004 0.0100707 -0.000005 -0.0190142 0.000005 -0.0326301 0.1524924 -0.0000061 0.0003696 -0.0000182 0.0014816 0.0000165 0.1131747 0.0000144 -0.0782499 -0.0873389 0.0000043 -0.0294396 -0.000003 -0.0315506 0.00001 0.0638373 0.0000064 -0.1316576 -0.3145163 -0.0000002 0.0553906 0.0000414 0.0080403 0.0000065 -0.1863029 0.0000147 -0.0292436 0.023163 -0.1170813 0.0673045 0.0561857 0.0233815 -0.0142212 0.004886 -0.0135819 -0.0919629 0.0231581 0.1170632 0.0673295 -0.056191 0.0233751 0.014242 0.0048865 0.0136074 -0.0919599 -0.108587 0.1308894 0.0345078 0.1734742 0.0691899 0.0399521 0.008547 0.0756825 -0.1135235 -0.1085901 -0.1308924 0.0344825 -0.173474 0.0692168 -0.0399189 0.0085107 -0.0756464 -0.1135459 0.0342151 -0.0000106 0.12041 -0.0000078 -0.0009887 0.0000077 0.096404 0.0000075 -0.0874823 -0.0300323 0.0110839 0.0027748 0.0815559 -0.0082558 0.0783169 0.0330125 0.0359273 0.0141709 -0.0300323 -0.0110835 0.0027717 -0.0815597 -0.0082274 -0.0783148 0.0329988 -0.0359303 0.0141498 -0.0404565 0.0195734 -0.0027182 0.0327296 -0.015719 -0.0934423 -0.0117742 -0.0761849 -0.0109976 -0.0404613 -0.0195711 -0.0027179 -0.0327241 -0.0157697 0.0934399 -0.0117802 0.0761838 -0.01094 -0.1673456 0.0000228 -0.0799709 0.0000104 0.1372807 0.0000148 0.0076521 0.000012 0.0554103 0.1643987 -0.0432467 -0.0176182 0.0174404 -0.0181807 -0.0912016 0.0496426 -0.0715841 0.0477746 0.1644086 0.0432415 -0.0176001 -0.0174697 -0.018233 0.0911792 0.0496424 0.0715569 0.0478289 0.0569569 0.0908389 -0.0509019 0.0691676 -0.0135668 0.0286717 -0.0254468 0.0253099 0.1109296 0.0569577 -0.0908286 -0.0509188 -0.0691616 -0.0135522 -0.0286928 -0.0254594 -0.0253334 0.1109223 0.0380372 -0.0741108 -0.0416204 -0.1003221 -0.0625927 -0.0351886 -0.0606036 -0.0364858 0.1365053 0.0380385 0.0741186 -0.0416069 0.1003325 -0.062608 0.0351527 -0.0605846 0.0364497 0.1365184 -0.0880293 0.0000101 -0.1017852 0.0000108 0.0915719 -0.0000009 -0.1062192 -0.0000009 0.1089512 unknown
polarizability: 200.2764934|-0.0024963|122.1660429|13.5678682|0.0033412|87.563427 unknown
InChI: InChI=1S/C9H12O2S/c1-2-12(10,11)8-9-6-4-3-5-7-9/h3-7H,2,8H2,1H3
charge 0 multiplicity 1
24 atoms
S  1.752558 0.000024 -0.197636
O  1.644766 1.428114 -0.995662
O  1.644605 -1.427817 -0.996082
C  0.36872 -0.000102 1.279449
C  3.47398 -0.000206 0.733935
C  -0.987397 -0.000035 0.67644
C  4.576229 -0.000073 -0.321004
C  -1.635306 -1.226698 0.365191
C  -1.635295 1.226692 0.365417
C  -2.916005 -1.225061 -0.224926
C  -2.915992 1.225174 -0.224701
C  -3.560898 0.000087 -0.517129
H  0.638423 -0.916103 1.826802
H  0.638447 0.915794 1.826967
H  3.444111 0.912114 1.351586
H  3.444034 -0.912732 1.351279
H  5.565071 -0.000184 0.173953
H  4.511129 -0.896469 -0.961567
H  4.511185 0.896536 -0.961276
H  -1.127922 -2.174836 0.575621
H  -1.127902 2.174786 0.576024
H  -3.408617 -2.173863 -0.462998
H  -3.408596 2.174024 -0.462599
H  -4.556026 0.000134 -0.975587
