program: Gaussian 09
title: 000248346
version: EM64L-G09RevD.01
frameworkgroup: C1[X(C15H12N2S)]
method: RPBEPBE
basis: SDD
operation: Freq
keyword: #p
keyword: freq=noraman
keyword: PBEPBE/SDD
title: #p freq=noraman PBEPBE/SDD
converged: YES YES NO NO
title: Mulliken charges:
elementType: S N N C C C C C C C C C C C C C C C H H H H H H H H H H H H
charge: 0.209170 0.002944 -0.038093 0.375375 -0.787983 -0.365871 0.473624 0.076055 -0.327124 -0.319364 -0.377095 -0.376715 -0.238537 -0.208698 -0.220806 -0.221004 -0.235031 -0.404387 0.294150 0.295973 0.246603 0.263256 0.238617 0.238473 0.233730 0.236102 0.228725 0.228734 0.230916 0.248259
chargesum: 0.00000
title: Mulliken charges with hydrogens summed into heavy atoms:
elementType: S N N C C C C C C C C C C C C C C C
charge: 0.209170 0.002944 -0.038093 0.375375 -0.197860 -0.365871 0.473624 0.076055 -0.080520 -0.056108 -0.138478 -0.138242 -0.004807 0.027404 0.007919 0.007730 -0.004115 -0.156128
polarizability: 3.15912051e+02 4.51387077e+00 1.75638850e+02 5.99993730e-02 3.57035446e-01 1.17594490e+02
1716.lowfreq: -7.6386 -0.0011 0.0013 0.0017 0.4412 4.8856 12.0806 25.8307 47.2943
frequency: 11.8103 25.2168 47.2815 58.9034 90.2500 125.0381 171.3315 176.3699 234.6192 259.3054 320.4922 393.9931 401.8753 414.7111 437.4270 465.4417 477.6897 506.3162 534.9533 558.9731 567.2870 616.8268 645.7650 654.4824 665.7208 702.4662 774.5106 775.8429 791.5240 796.4177 800.6142 811.6426 852.4810 880.2117 884.3754 927.5631 936.2319 961.3220 969.8712 977.9802 989.9445 997.6998 999.8202 1021.3898 1026.2507 1073.7193 1093.9165 1121.0659 1145.4184 1169.6091 1173.4816 1187.5237 1204.4157 1218.2778 1242.0757 1259.6531 1289.2391 1320.9664 1324.5526 1370.6436 1384.6152 1401.2781 1427.9217 1440.2306 1440.9098 1471.2577 1483.8192 1502.7959 1551.9774 1593.4995 1614.0276 1619.4300 3055.6333 3122.9510 3124.7978 3131.9120 3132.6012 3137.5712 3142.8438 3149.5230 3158.5366 3161.1703 3165.8360 3175.6443
redmass: 5.3920 3.9461 5.8185 4.7894 5.2624 6.4746 5.9914 5.9588 5.8569 5.6118 2.2250 10.8557 2.8016 3.1610 5.8733 3.4869 4.0474 8.4025 7.3620 6.1823 3.8975 6.3284 5.0761 4.3318 6.6055 1.6544 1.3433 2.1906 3.7558 7.2463 6.0479 4.2555 1.2510 1.5645 1.5756 1.4506 1.4400 7.9975 1.3721 1.3911 6.1648 1.3230 1.3308 2.1818 2.1918 1.4793 3.2708 1.0852 2.0093 1.1803 1.0528 1.1127 2.6919 1.9948 1.6279 1.9848 2.8901 4.0534 1.2808 1.8105 8.8512 3.6923 2.2016 1.9146 1.2124 3.1361 2.3630 6.2658 6.7941 6.1100 6.1502 6.4890 1.0582 1.0852 1.0891 1.1074 1.0861 1.0920 1.0904 1.0964 1.0921 1.0959 1.1017 1.0991
irintensity: 0.0121 0.4246 0.4661 1.5506 0.7297 2.3823 0.4376 0.6912 0.1037 1.2090 0.8103 4.2075 0.0083 5.8138 4.4384 3.0473 3.7490 4.1081 0.1485 30.1301 2.3623 0.1254 51.5720 4.8973 28.3765 60.0654 86.7923 28.7459 0.6879 40.1623 8.0656 9.7745 0.0087 0.9521 0.0037 3.8178 11.6587 36.7314 2.8633 0.0061 0.5842 0.0880 0.2284 5.1461 7.3006 8.7555 5.0888 1.6845 14.9353 2.1169 0.0226 2.8591 36.3971 0.3044 67.6458 0.1940 2.9374 270.8565 0.2569 19.5618 0.1678 17.3469 4.2838 8.7851 8.8558 123.0056 12.0608 47.1817 68.1221 1.0020 2.1405 10.9338 4.7217 6.4113 0.5668 2.3109 0.3784 14.9914 10.2382 38.8891 29.3711 11.1326 25.3720 19.7158
temp: 298.150 k
press: 1.00000 atm
elementType: 16 7 7 6 6 6 6 6 6 6 6 6 6 6 6 6 6 6 1 1 1 1 1 1 1 1 1 1 1 1
symmnumber: 1
zpe: 601276.5 jmol-1
zpe.correction: 0.229014 hartree
zpe.thermalcorrener: 0.243839 hartree
zpe.thermalcorrenthalpy: 0.244783 hartree
zpe.thermalcorrgfe: 0.183687 hartree
zpe.sumelectzpe: -1085.125361 hartree
zpe.sumelectthermal: -1085.110536 hartree
zpe.sumelectthermalent: -1085.109591 hartree
zpe.sumelectthermalfe: -1085.170688 hartree
dipole: -1.0924 -2.0710 -0.0077
dipole: 2.3415
quadrupole: -96.8705 -110.6082 -109.1511
quadrupole: -8.4015 0.0126 0.1354
quadrupole: 8.6728 -5.0649 -3.6079 -8.4015 0.0126 0.1354
hfenergy: -1085.3543746 hartree
pointgroup: C01 [X(C15H12N2S1)]
dipole: 0.4293678 0.7890441 0.2041866 debye
polarizability: 315.9011508|4.7175837|172.0031081|0.0836914|14.0776856|121.2411332 unknown
InChI: InChI=1S/C15H12N2S/c1-2-6-12(7-3-1)10-18-15-13-8-4-5-9-14(13)16-11-17-15/h1-9,11H,10H2
charge 0 multiplicity 1
30 atoms
S  0.505844 0.553083 0.066758
N  -0.999977 -1.656374 -0.517484
N  -3.436422 -1.810587 -0.535144
C  -2.312052 0.333856 0.03342
C  1.769479 -0.8364 -0.342925
C  -1.054753 -0.357997 -0.165601
C  3.166793 -0.291983 -0.182574
C  -3.50318 -0.463098 -0.170998
C  -2.440717 1.706619 0.403999
C  -4.786036 0.139925 0.002211
C  3.836188 -0.379963 1.065755
C  3.837791 0.310213 -1.278665
C  -3.709315 2.273797 0.566975
C  -4.885996 1.486854 0.365092
C  5.149394 0.118052 1.214474
C  5.151019 0.809194 -1.132415
C  5.810663 0.714158 0.115204
C  -2.204925 -2.320114 -0.685079
H  1.5404 -1.158048 -1.369688
H  1.539428 -1.66356 0.344621
H  -1.541294 2.312997 0.559374
H  -5.668821 -0.485968 -0.158856
H  3.32489 -0.840704 1.919525
H  3.327813 0.385314 -2.246657
H  -3.804683 3.327211 0.851006
H  -5.871804 1.94599 0.496681
H  5.656436 0.0401 2.182618
H  5.658979 1.267993 -1.987944
H  6.830243 1.098928 0.22925
H  -2.125284 -3.373991 -0.969335
