program: Gaussian 09
title: 000248347
version: EM64L-G09RevD.01
frameworkgroup: C1[X(C15H12N2S)]
method: RPBEPBE
basis: SDD
operation: Freq
keyword: #p
keyword: freq=noraman
keyword: PBEPBE/SDD
title: #p freq=noraman PBEPBE/SDD
converged: YES YES NO NO
title: Mulliken charges:
elementType: S N N C C C C C C C C C C C C C C C H H H H H H H H H H H H
charge: 0.211339 -0.035935 0.046325 0.360911 0.073652 -0.367699 -0.151410 0.449004 -0.324089 -0.318978 -0.214405 -0.208134 -0.369146 -0.380568 -0.239961 -0.208479 -0.804136 -0.405893 0.247248 0.263259 0.250381 0.250068 0.233059 0.233273 0.233507 0.235989 0.226575 0.225958 0.239991 0.248297
chargesum: 0.00000
title: Mulliken charges with hydrogens summed into heavy atoms:
elementType: S N N C C C C C C C C C C C C C C C
charge: 0.211339 -0.035935 0.046325 0.360911 0.073652 -0.367699 -0.151410 0.449004 -0.076841 -0.055719 0.035976 0.041934 -0.136087 -0.147295 -0.006454 0.027510 -0.111612 -0.157597
polarizability: 3.12795077e+02 -1.81198102e+01 1.69210721e+02 1.22642965e+00 1.91057952e-01 1.17646299e+02
1716.lowfreq: -5.6824 -3.5882 -0.0013 0.0012 0.0017 7.7955 14.4188 17.2335 22.4995
frequency: 13.7405 17.0531 22.2390 39.1487 84.3511 127.9831 156.8070 173.1758 222.5913 242.6585 289.7285 357.0798 372.6411 389.6919 405.1227 414.4377 451.4272 463.2178 493.0672 515.2110 542.8386 567.2290 611.7871 630.5200 653.5417 660.3455 709.2224 773.7304 786.1971 791.6794 791.9013 798.7085 819.7801 844.6763 881.8359 934.9390 952.7563 955.6239 968.8612 974.1962 985.3866 1000.0267 1001.5013 1021.3928 1047.1960 1078.6651 1094.5051 1116.3401 1145.9419 1170.3600 1188.2254 1205.8963 1219.6955 1258.4164 1285.8708 1295.2120 1322.1569 1367.0551 1369.4871 1392.9117 1396.3801 1398.9834 1428.3142 1470.1081 1471.5714 1473.4877 1482.5700 1506.8202 1551.1893 1582.4521 1606.1578 1619.3740 2977.0406 3058.6355 3087.2369 3126.2547 3128.3313 3133.1093 3143.8270 3158.3269 3160.6213 3161.3595 3162.7761 3175.2816
redmass: 2.3259 2.2932 1.9115 4.8588 4.7948 4.6597 5.8486 5.8798 5.1615 5.7539 4.7901 2.8044 7.2954 11.4114 2.8614 3.1361 4.9635 3.4746 4.3692 5.7148 6.5064 3.8886 5.8026 6.9714 4.2937 6.9293 3.3119 1.3471 5.7534 6.2819 4.0121 6.0498 1.3802 1.2469 1.6115 1.4433 3.6285 1.6365 1.3727 1.3847 1.4056 1.3307 4.3473 2.1963 1.5764 2.8202 3.2281 1.3060 2.0675 1.1731 1.1142 2.7859 3.0321 2.1247 2.8020 1.2697 4.3692 4.9928 1.8246 3.3194 1.2264 3.4307 2.2160 1.0878 3.0673 1.0583 2.5294 6.6320 6.8183 6.4319 6.3060 6.4667 1.0386 1.0951 1.0999 1.0891 1.0891 1.0859 1.0904 1.0956 1.0947 1.0934 1.0967 1.0992
irintensity: 0.0127 1.8475 0.0133 1.3417 0.3734 0.1855 0.9804 1.0495 0.2174 0.0040 0.3249 0.7319 2.2331 3.7193 0.1218 5.6938 12.3010 2.7386 5.5568 9.4463 3.5291 2.4729 1.5289 0.0002 4.5868 42.5751 0.6245 87.7121 18.1747 18.7149 3.8684 8.9465 56.6074 0.2283 0.5681 11.0887 31.5908 7.5876 2.6844 0.1265 0.2337 0.1845 25.3298 5.8805 16.9780 2.8270 3.1765 10.8136 14.6470 2.2743 14.3708 17.8297 4.1549 10.8234 9.6241 0.7331 257.9899 0.1920 18.6738 4.9162 11.9920 18.6095 2.2403 13.3994 99.1668 12.3449 33.5915 50.7792 62.6099 0.1544 4.5810 9.4474 34.3467 22.8347 17.4500 13.1068 20.9132 0.8440 10.9399 15.3535 31.5032 3.7168 0.4497 20.5777
temp: 298.150 k
press: 1.00000 atm
elementType: 16 7 7 6 6 6 6 6 6 6 6 6 6 6 6 6 6 6 1 1 1 1 1 1 1 1 1 1 1 1
symmnumber: 1
zpe: 597703.3 jmol-1
zpe.correction: 0.227653 hartree
zpe.thermalcorrener: 0.243105 hartree
zpe.thermalcorrenthalpy: 0.244049 hartree
zpe.thermalcorrgfe: 0.180780 hartree
zpe.sumelectzpe: -1085.123043 hartree
zpe.sumelectthermal: -1085.107590 hartree
zpe.sumelectthermalent: -1085.106646 hartree
zpe.sumelectthermalfe: -1085.169916 hartree
dipole: -0.7363 -1.3649 0.0499
dipole: 1.5516
quadrupole: -84.9423 -114.7675 -108.8430
quadrupole: -11.2380 0.3081 0.1592
quadrupole: 17.9087 -11.9166 -5.9921 -11.2380 0.3081 0.1592
hfenergy: -1085.3506957 hartree
pointgroup: C01 [X(C15H12N2S1)]
dipole: 0.3045798 -0.4980888 -0.1783224 debye
polarizability: 310.461096|15.2046368|163.3034998|22.193755|17.6655125|125.8875015 unknown
InChI: InChI=1S/C15H12N2S/c1-11-6-8-12(9-7-11)18-15-13-4-2-3-5-14(13)16-10-17-15/h2-10H,1H3
charge 0 multiplicity 1
30 atoms
S  0.302244 -1.679303 -0.321567
N  -2.463811 1.896787 0.766949
N  -0.259299 0.865598 0.577922
C  -2.224045 -0.429005 -0.081564
C  -3.031881 0.719333 0.275786
C  -0.797725 -0.26646 0.10737
C  1.972395 -0.990433 0.049228
C  4.596561 -0.040398 0.58009
C  -2.859269 -1.606528 -0.581367
C  -4.450382 0.65063 0.122029
C  2.549741 -1.200454 1.319443
C  2.69067 -0.316369 -0.960481
C  3.855032 -0.727117 1.576627
C  3.995139 0.153035 -0.690607
C  -4.250461 -1.647247 -0.72239
C  -5.04835 -0.514134 -0.368926
C  5.986478 0.494805 0.875787
C  -1.127277 1.901018 0.887212
H  -2.252609 -2.476881 -0.854796
H  -5.035684 1.532393 0.399472
H  1.985835 -1.725026 2.097147
H  2.235824 -0.158373 -1.943379
H  4.301391 -0.892827 2.564483
H  4.550942 0.676646 -1.477585
H  -4.734931 -2.551327 -1.106355
H  -6.136444 -0.562833 -0.48572
H  6.529229 -0.15428 1.585459
H  6.592944 0.581644 -0.042532
H  5.931579 1.503127 1.330429
H  -0.655636 2.81148 1.269436
