program: Gaussian 09
title: 000248326
version: EM64L-G09RevD.01
frameworkgroup: C1[X(C12H21N5O3)]
method: RPBEPBE
basis: SDD
operation: Freq
keyword: #p
keyword: freq=noraman
keyword: PBEPBE/SDD
title: #p freq=noraman PBEPBE/SDD
converged: YES YES NO NO
title: Mulliken charges:
elementType: O O O N N N N N C C C C C C C C C C C C H H H H H H H H H H H H H H H H H H H H H
charge: -0.228027 -0.233832 -0.245926 -0.433493 -0.192674 0.082071 -0.406380 -0.645009 0.254936 -0.439726 -0.356152 -0.382037 0.118965 -0.356902 -0.332196 0.174340 -0.357045 -0.606081 -0.695833 0.308817 0.230875 0.223558 0.210127 0.216827 0.194314 0.193244 0.353689 0.191272 0.192919 0.246165 0.196045 0.195140 0.266003 0.247807 0.245113 0.215886 0.210284 0.211296 0.277193 0.349167 0.305258
chargesum: 0.00000
title: Mulliken charges with hydrogens summed into heavy atoms:
elementType: O O O N N N N N C C C C C C C C C C C C
charge: -0.228027 -0.233832 -0.245926 -0.079804 -0.192674 0.082071 -0.129187 0.009417 0.254936 0.014708 0.070802 0.005520 0.118965 0.027290 -0.086031 0.174340 0.034140 0.152842 -0.058368 0.308817
polarizability: 2.19994086e+02 -2.65495286e+01 1.66821165e+02 5.00044249e+00 4.13556577e+00 1.63807267e+02
1716.lowfreq: -7.7848 -0.0006 0.0007 0.0008 1.3045 5.2140 19.0048 31.1940 32.5093
frequency: 18.7541 31.1833 32.4979 38.8390 47.3744 57.6419 76.8852 86.1278 89.9656 115.8141 123.6434 129.7949 140.5663 154.1092 170.9370 195.8575 223.2739 231.9990 239.9077 252.4243 260.3660 291.9156 320.0392 354.9880 366.9224 382.2936 426.7618 434.7603 475.2015 504.4640 537.9019 565.7393 574.4372 587.8642 612.3678 655.5668 679.7671 708.4770 710.5061 724.5204 731.0103 737.0850 752.1593 794.0869 875.5889 883.2378 894.1066 900.6332 935.1759 966.5201 989.4669 1013.9402 1014.3432 1044.2149 1061.3352 1068.1052 1075.4868 1082.0586 1112.1485 1124.6599 1130.8440 1149.8350 1183.5431 1199.9123 1221.3840 1234.7738 1252.4814 1261.9927 1279.5801 1285.2919 1288.1534 1292.4784 1302.9233 1323.4112 1330.4797 1351.2082 1355.7612 1362.8522 1382.2089 1390.9998 1438.3741 1451.5444 1464.2409 1465.7428 1472.7860 1474.1154 1477.5885 1482.6175 1484.0359 1489.1609 1503.2441 1605.6538 1613.3396 1649.1550 1687.7032 1718.6639 2953.1348 2957.4545 2967.9254 2972.3792 2974.2034 2985.4249 2989.8376 3000.3853 3005.2744 3009.2442 3025.1047 3036.9387 3057.3504 3068.8576 3071.5111 3091.4543 3119.0256 3391.2756 3538.4621 3570.1086 3693.5498
redmass: 5.7475 4.3513 4.6734 4.7458 1.5534 4.5829 1.4461 2.0922 3.4577 1.6475 5.6020 3.3955 5.7086 2.9890 2.0680 4.8775 3.0664 1.1857 3.7247 3.3589 3.3357 4.2053 2.6212 2.2321 5.7081 5.0818 3.1759 3.4611 3.1199 1.1371 1.3911 3.0867 1.5368 5.1927 5.2320 4.5585 5.5546 5.9229 7.4350 1.0717 7.2856 1.5965 2.0533 1.3332 1.3103 1.9934 1.9181 2.3798 2.7405 1.6783 1.9350 3.2030 3.8774 2.4031 2.7477 2.0340 2.8702 2.3039 2.6397 3.9598 1.3114 3.5353 2.3761 2.0809 2.2167 1.3555 1.7980 1.8825 1.3140 1.4290 1.1684 1.1753 1.4541 1.4666 1.5675 1.5286 1.6739 3.4365 1.8474 1.2165 1.3389 1.1000 1.0647 1.0768 1.0429 1.0719 1.0431 1.0795 1.0628 1.0904 1.7770 1.4166 4.2320 11.0420 5.5774 9.8800 1.0586 1.0588 1.0591 1.0369 1.0592 1.0591 1.0969 1.0330 1.1005 1.0890 1.1022 1.1037 1.1045 1.1007 1.0993 1.1022 1.1017 1.0756 1.0460 1.0794 1.1037
irintensity: 1.1873 3.3344 15.7690 0.9781 0.3129 4.9501 0.7803 0.1719 0.3495 0.0403 1.1320 4.8704 6.8423 1.0819 6.4393 1.7915 1.5393 0.2559 0.4248 1.3497 5.8086 8.7326 16.0917 32.1395 14.5781 36.8908 1.0627 2.6285 16.4799 210.3704 156.2370 52.2763 99.8574 4.0201 16.2933 8.8822 11.4847 10.9606 34.7562 15.0445 23.8063 4.5644 0.5861 5.2410 0.7275 20.0644 2.1208 40.1105 11.9624 14.2961 11.8841 7.4404 5.4295 21.7382 8.9611 13.9527 9.5158 3.0148 9.3720 88.0066 0.1038 116.7710 1.6731 6.9636 9.1451 10.6549 19.0828 64.6371 127.5940 88.7809 73.6478 28.2779 108.1656 34.2230 60.6096 1.2956 5.3179 129.6957 15.8081 11.0190 95.3991 13.8592 0.6537 0.4757 18.6800 0.7164 12.5540 2.5447 12.8949 22.3662 323.6905 134.2916 2.2110 513.9651 268.3837 285.4215 0.8548 7.8333 59.0139 33.3403 41.0027 46.9143 1.7240 33.2763 0.7846 31.3118 9.6320 33.1798 49.1200 95.3542 54.2751 19.3545 0.5994 8.3612 60.7259 72.2887 46.1523
temp: 298.150 k
press: 1.00000 atm
elementType: 8 8 8 7 7 7 7 7 6 6 6 6 6 6 6 6 6 6 6 6 1 1 1 1 1 1 1 1 1 1 1 1 1 1 1 1 1 1 1 1 1
symmnumber: 1
zpe: 880599.9 jmol-1
zpe.correction: 0.335403 hartree
zpe.thermalcorrener: 0.358373 hartree
zpe.thermalcorrenthalpy: 0.359317 hartree
zpe.thermalcorrgfe: 0.279990 hartree
zpe.sumelectzpe: -967.775755 hartree
zpe.sumelectthermal: -967.752786 hartree
zpe.sumelectthermalent: -967.751841 hartree
zpe.sumelectthermalfe: -967.831168 hartree
dipole: 2.1133 -2.5383 -5.2936
dipole: 6.2395
quadrupole: -91.1608 -118.5482 -135.0463
quadrupole: -9.1457 -24.3497 2.8431
quadrupole: 23.7577 -3.6298 -20.1279 -9.1457 -24.3497 2.8431
hfenergy: -968.1111581 hartree
pointgroup: C01 [X(C12H21N5O3)]
dipole: 0.9568064 -1.9549688 -1.1351968 debye
polarizability: 212.9815673|-20.9410659|170.5714268|25.4257749|-2.7845306|167.069523 unknown
InChI: InChI=1S/C12H21N5O3/c1-3-4-5-6-7-12(8-14-16-10(13)19)9(18)17(2)11(20)15-12/h8,15-16H,3-7,13H2,1-2H3
charge 0 multiplicity 1
41 atoms
O  0.11216 0.283333 -2.771748
O  0.313256 3.494285 0.666608
O  4.076242 -0.865221 3.015261
N  0.389107 1.109493 0.699507
N  0.092845 2.139093 -1.293676
N  2.439598 -0.722733 0.747211
N  3.608522 -1.446545 0.768696
N  5.601436 -2.134998 1.78518
C  0.368499 0.017618 -0.286701
C  -0.822429 -0.976877 -0.077962
C  -2.217682 -0.319539 -0.116761
C  -3.342152 -1.327096 0.213975
C  0.183115 0.791872 -1.623224
C  -4.752122 -0.698255 0.148183
C  1.67706 -0.761427 -0.311704
C  0.274797 2.365456 0.124606
C  -5.880335 -1.693558 0.502789
C  -0.105998 3.230959 -2.248116
C  -7.286444 -1.06066 0.425084
C  4.407991 -1.432444 1.946465
H  -0.664008 -1.480037 0.896189
H  -0.752096 -1.751874 -0.866312
H  -2.400278 0.109098 -1.122812
H  -2.250417 0.519376 0.605762
H  -3.174782 -1.745403 1.228625
H  -3.290436 -2.184098 -0.489849
H  0.810332 0.98165 1.621185
H  -4.927177 -0.295056 -0.871189
H  -4.800331 0.169897 0.838267
H  1.874085 -1.352623 -1.226364
H  -5.7080 -2.090164 1.5243
H  -5.826499 -2.564655 -0.181962
H  -0.065584 4.176118 -1.683238
H  0.685321 3.21938 -3.016558
H  -1.084738 3.136026 -2.748778
H  -8.074846 -1.790206 0.686688
H  -7.496953 -0.686443 -0.594664
H  -7.374027 -0.204347 1.120299
H  3.890131 -2.013873 -0.043864
H  6.210745 -2.1868 2.597794
H  5.929289 -2.517423 0.900506
