program: Gaussian 09
title: 000248322
version: EM64L-G09RevD.01
frameworkgroup: C1[X(C12H16O3)]
method: RPBEPBE
basis: SDD
operation: Freq
keyword: #pfreq=noraman
keyword: PBEPBE/SDD
title: #p freq=noraman PBEPBE/SDD
converged: YES YES NO NO
title: Mulliken charges:
elementType: O O O C C C C C C C C C C C C H H H H H H H H H H H H H H H H
charge: -0.289767 -0.248295 -0.193285 -0.555426 -0.491299 0.494290 0.178601 -0.084626 -0.402755 -0.423054 -0.229894 -0.225815 -0.243567 -0.498575 -0.533776 0.231311 0.225471 0.250718 0.282960 0.230156 0.232330 0.232869 0.223663 0.223751 0.227231 0.237000 0.233684 0.209288 0.229161 0.255473 0.222177
chargesum: 0.00000
title: Mulliken charges with hydrogens summed into heavy atoms:
elementType: O O O C C C C C C C C C C C C
charge: -0.289767 -0.248295 -0.193285 -0.098644 0.042380 0.494290 0.178601 0.145530 -0.170425 -0.190185 -0.006231 -0.002064 -0.016336 0.181396 0.173035
polarizability: 1.69231102e+02 -2.03724051e+01 1.14791042e+02 6.81590628e+00 5.53769753e+00 1.20648711e+02
1716.lowfreq: -10.7949 -5.5127 0.0007 0.0010 0.0011 6.7863 11.8279 24.4658 45.2277
frequency: -4.8876 23.4407 45.0961 49.2138 81.4435 104.9623 113.7420 132.5866 149.6804 186.4889 201.2661 240.2081 248.9629 309.4737 329.5908 360.1532 392.5725 403.6203 490.0400 512.7690 550.8192 582.5354 618.2584 700.6497 706.3066 743.3412 759.1644 821.3802 842.4476 853.6333 868.5338 896.3611 919.5171 973.0463 975.5727 989.8327 993.1232 1001.7193 1011.4760 1026.9344 1061.1860 1080.9356 1107.1971 1112.2859 1120.5986 1126.6411 1151.1419 1159.7118 1171.5735 1186.2385 1217.5043 1255.4525 1273.5410 1291.9485 1325.8170 1326.6657 1348.6821 1382.1733 1418.2759 1422.1696 1427.3683 1440.1437 1453.7327 1459.5569 1474.0468 1476.8568 1484.5535 1488.1450 1592.9561 1614.7558 1637.3750 2942.3875 2958.8572 2977.8621 2983.2797 3006.2136 3020.7643 3056.2890 3065.1341 3087.5036 3113.2052 3114.6549 3121.1885 3123.0652 3130.6884 3142.7134 3161.4618
redmass: 3.7713 4.0718 4.9527 4.4723 2.3432 2.1175 1.5366 2.0134 1.4455 3.2283 3.0345 3.9390 4.6591 3.5446 2.5689 5.4621 4.2493 2.8190 3.0070 3.6684 4.5134 4.9958 6.3632 2.4972 1.7388 2.1466 2.0784 2.8131 3.4578 1.2811 3.7061 4.2082 1.6117 2.7834 1.5046 6.0623 1.3294 2.7309 7.7327 2.1914 4.1500 1.5969 1.4908 1.2987 1.9278 1.2458 1.3588 1.3967 1.0519 1.1138 2.3616 1.2260 1.3394 1.5271 1.2223 1.2653 1.7068 7.8324 1.1258 1.0934 1.1403 2.1821 1.0520 1.0536 1.1142 1.0526 2.2743 1.0541 6.0545 6.2149 9.5050 1.0811 1.0350 1.0631 1.0315 1.0604 1.0942 1.0990 1.1024 1.1018 1.0871 1.0869 1.1018 1.1036 1.0906 1.0958 1.1015
irintensity: 0.1465 0.0217 1.7172 0.6192 0.8698 3.5538 3.1743 0.3356 0.8834 1.1677 11.2517 4.8320 19.1751 3.8487 0.2548 1.7537 2.7697 0.0015 2.1186 31.3759 7.0517 4.7740 0.1099 5.9188 63.4769 18.1653 34.6798 2.8921 2.8416 0.4785 49.5354 19.6545 5.5959 82.1666 13.2869 0.5701 0.7732 41.4295 130.3816 13.4246 47.8170 16.0795 2.9240 1.9263 16.6621 8.4189 1.1207 1.8396 0.1084 0.2825 0.0980 15.7187 26.6419 13.1552 3.5891 0.9314 19.8693 0.2051 21.7362 24.6342 6.4730 6.7902 10.4385 6.6643 15.8913 18.6878 22.2492 12.0053 1.3393 17.2200 97.4192 42.7653 64.6854 11.4937 41.5136 17.9054 1.2685 44.3628 16.1167 28.1823 9.4575 8.1331 18.9579 25.2088 10.6711 45.8949 23.7685
temp: 298.150 k
press: 1.00000 atm
elementType: 8 8 8 6 6 6 6 6 6 6 6 6 6 6 6 1 1 1 1 1 1 1 1 1 1 1 1 1 1 1 1
symmnumber: 1
zpe: 665748.5 jmol-1
zpe.correction: 0.253570 hartree
zpe.thermalcorrener: 0.268776 hartree
zpe.thermalcorrenthalpy: 0.269720 hartree
zpe.thermalcorrgfe: 0.209363 hartree
zpe.sumelectzpe: -691.362802 hartree
zpe.sumelectthermal: -691.347595 hartree
zpe.sumelectthermalent: -691.346651 hartree
zpe.sumelectthermalfe: -691.407008 hartree
dipole: 0.0014 3.0508 0.0371
dipole: 3.0510
quadrupole: -85.9119 -93.2709 -81.8438
quadrupole: 5.4835 4.8483 -0.9489
quadrupole: 1.0970 -6.2620 5.1651 5.4835 4.8483 -0.9489
hfenergy: -691.6163717 hartree
pointgroup: C01 [X(C12H16O3)]
dipole: 0.1790187 0.5397882 -1.0570885 debye
polarizability: 163.0253262|-8.6708702|125.5992308|25.8830303|-4.8568622|116.0462973 unknown
InChI: InChI=1S/C12H16O3/c1-14-12(15-2)11(13)9-8-10-6-4-3-5-7-10/h3-7,12H,8-9H2,1-2H3
charge 0 multiplicity 1
31 atoms
O  2.774624 0.152977 -0.925611
O  4.054901 -1.253893 0.578007
O  1.585549 -1.405808 1.981228
C  -0.984697 -0.610254 1.029834
C  0.267747 -0.507924 0.126875
C  -2.2247 -0.081846 0.323799
C  1.539954 -1.010112 0.78998
C  2.807857 -1.062609 -0.115306
C  -2.499602 1.310418 0.288233
C  -3.11374 -0.961134 -0.346376
C  -3.62724 1.811278 -0.399762
C  -4.243469 -0.465573 -1.037131
C  -4.503609 0.923852 -1.067575
C  3.760687 0.140554 -2.01997
C  4.384851 -0.222333 1.587404
H  -0.792979 -0.046514 1.961385
H  -1.125359 -1.664677 1.330381
H  0.117651 -1.061138 -0.823488
H  0.451823 0.536253 -0.196259
H  2.738318 -1.963854 -0.765919
H  -1.828673 2.004519 0.810647
H  -2.922849 -2.041513 -0.31972
H  -3.825781 2.889181 -0.411644
H  -4.921348 -1.161226 -1.545083
H  -5.380459 1.309909 -1.599477
H  4.790437 0.05991 -1.627067
H  3.627924 1.095147 -2.551291
H  3.566943 -0.705145 -2.711056
H  5.441227 -0.399857 1.83995
H  3.754159 -0.346299 2.48357
H  4.261253 0.793409 1.167042
