program: Gaussian 09
title: 000248320
version: EM64L-G09RevD.01
frameworkgroup: C1[X(C13H19NO2)]
method: RPBEPBE
basis: SDD
operation: Freq
keyword: #p
keyword: freq=noraman
keyword: PBEPBE/SDD
title: #p freq=noraman PBEPBE/SDD
converged: YES YES NO NO
title: Mulliken charges:
elementType: O O N C C C C C C C C C C C C C H H H H H H H H H H H H H H H H H H H
charge: -0.417903 -0.250636 -0.359489 -0.109467 -0.657506 -0.330676 -0.384255 -0.341319 0.489923 0.218209 -0.689158 -0.399077 -0.413136 -0.235167 -0.230268 -0.240986 0.252576 0.241290 0.216304 0.223262 0.181816 0.277101 0.175510 0.214928 0.196000 0.192573 0.216873 0.212272 0.208547 0.266373 0.228957 0.225355 0.222891 0.227120 0.371162
chargesum: 0.00000
title: Mulliken charges with hydrogens summed into heavy atoms:
elementType: O O N C C C C C C C C C C C C C
charge: -0.046741 -0.250636 -0.082388 0.143108 -0.199912 0.074402 0.006183 0.047254 0.489923 0.218209 -0.051466 -0.132703 -0.184179 -0.009812 -0.007377 -0.013866
polarizability: 1.99296806e+02 8.38135907e+00 1.41320394e+02 1.03073659e+01 -1.06807814e+01 1.14659088e+02
1716.lowfreq: -9.4924 -3.7780 -0.0006 -0.0005 -0.0005 3.7792 13.2175 26.5040 37.6116
frequency: 2.5525 26.3954 37.5232 44.4365 58.7360 85.3172 97.4035 110.2862 115.1806 163.9582 204.2708 225.0852 231.4845 237.4293 268.4553 342.0698 349.9636 403.7507 404.5219 442.4809 458.5000 525.1720 579.7533 601.4406 617.5394 618.5452 703.1834 709.4758 737.5274 757.7257 786.9113 802.7885 815.8456 854.8841 896.1256 921.4211 937.7235 970.4893 977.4077 990.2109 994.8338 1005.4086 1026.3668 1028.6924 1043.6872 1066.3471 1078.8360 1093.8188 1125.2299 1147.2941 1165.4782 1171.6867 1182.7142 1190.5199 1214.6086 1218.1415 1248.2885 1255.6297 1277.8691 1285.4420 1294.9395 1321.3632 1332.7253 1347.4504 1361.7834 1377.2270 1383.6629 1392.5911 1441.3615 1442.0019 1468.2677 1468.8554 1474.7772 1478.0971 1484.8058 1486.6411 1498.8591 1592.6694 1614.7320 1659.3000 2856.8235 2956.7648 2971.0707 2974.5430 2988.1487 2993.7281 3004.5116 3011.7312 3040.6739 3054.9293 3071.5355 3074.0364 3110.4304 3124.3522 3136.6769 3148.2284 3162.6824 3499.6188 3524.4504
redmass: 3.3271 4.0144 3.0407 3.5462 3.4744 4.3487 2.5714 3.8172 2.0738 4.4826 2.9136 3.8927 1.1254 2.2879 5.7442 2.2819 2.3049 3.7055 2.8936 3.4679 2.8864 3.2042 3.4076 3.2403 2.0036 2.9988 2.6545 2.3966 1.0757 1.9049 3.0795 1.1861 3.8040 1.2470 1.8204 1.4306 1.1775 1.9586 1.4310 4.5595 1.4077 4.1330 2.7512 2.4262 3.2329 1.9429 2.0503 1.8827 2.2294 1.7197 2.7342 1.0741 1.4350 1.1376 1.3863 2.3121 1.5657 1.2305 1.1656 1.0808 1.3416 1.4185 1.2698 1.4968 1.7030 1.4470 6.2502 1.2231 1.2936 2.1709 1.1170 1.0749 1.0641 1.0438 2.2521 1.0725 1.0845 6.0201 6.0899 8.1538 1.0715 1.0634 1.0594 1.0371 1.0791 1.0646 1.0859 1.0974 1.1018 1.1026 1.1006 1.0995 1.0874 1.0862 1.0918 1.0957 1.1015 1.0638 1.0761
irintensity: 0.4105 0.1048 0.4045 0.3824 0.3822 0.3129 0.3247 4.1124 1.5042 1.4187 18.9007 3.2508 0.5611 35.3243 10.1805 16.0615 26.2955 8.2185 0.8447 7.0951 9.3367 66.0084 31.0583 4.0591 61.5765 39.0883 40.8268 66.6628 7.6205 34.8579 6.4932 1.2564 0.9722 0.4840 6.6976 3.2519 1.6232 6.2951 1.2920 0.0701 0.3071 52.5108 108.4270 33.1125 8.0929 50.2456 6.2424 27.0439 1.8430 49.6752 47.2352 2.6508 12.9959 0.2626 5.6036 0.5881 4.6571 5.4560 2.7462 0.0529 2.5149 5.7125 1.1798 1.1064 31.3644 4.7403 0.3646 8.6947 32.9710 8.5506 8.3583 1.9357 2.0866 12.2338 20.4105 13.1644 9.6042 1.8083 8.2166 201.7457 97.1485 15.6180 59.8463 34.3770 9.4106 29.7032 28.4031 1.0328 46.2339 12.0634 84.0152 53.8029 10.7948 0.2835 23.5747 27.3451 22.9985 14.3631 4.0006
temp: 298.150 k
press: 1.00000 atm
elementType: 8 8 7 6 6 6 6 6 6 6 6 6 6 6 6 6 1 1 1 1 1 1 1 1 1 1 1 1 1 1 1 1 1 1 1
symmnumber: 1
zpe: 774952.3 jmol-1
zpe.correction: 0.295164 hartree
zpe.thermalcorrener: 0.312712 hartree
zpe.thermalcorrenthalpy: 0.313656 hartree
zpe.thermalcorrgfe: 0.244773 hartree
zpe.sumelectzpe: -710.751862 hartree
zpe.sumelectthermal: -710.734313 hartree
zpe.sumelectthermalent: -710.733369 hartree
zpe.sumelectthermalfe: -710.802252 hartree
dipole: -1.3697 -1.6187 0.7274
dipole: 2.2417
quadrupole: -90.7319 -93.7289 -97.4270
quadrupole: 0.6170 3.4299 4.0079
quadrupole: 3.2307 0.2337 -3.4644 0.6170 3.4299 4.0079
hfenergy: -711.0470253 hartree
pointgroup: C01 [X(C13H19N1O2)]
dipole: -0.5200217 0.5422973 -0.4619005 debye
polarizability: 198.8747309|-12.4348752|133.915125|-7.00994|-16.1808079|122.4864322 unknown
InChI: InChI=1S/C13H19NO2/c1-2-3-9-14-12(13(15)16)10-11-7-5-4-6-8-11/h4-8,12,14-15H,2-3,9-10H2,1H3
charge 0 multiplicity 1
35 atoms
O  -0.513371 -2.360216 -0.860058
O  0.382884 -2.271698 1.281968
N  -1.680446 0.077059 0.577042
C  -0.299204 -0.160025 0.126921
C  0.736357 0.652377 0.949021
C  -2.732027 0.297764 -0.426194
C  -4.121433 0.389175 0.235135
C  -5.253285 0.638806 -0.787716
C  2.15523 0.55489 0.403015
C  -0.063291 -1.672402 0.27823
C  -6.643456 0.740981 -0.12398
C  3.0496 -0.4495 0.855778
C  2.6017 1.463021 -0.592538
C  4.356556 -0.541934 0.326018
C  3.907255 1.372349 -1.124886
C  4.79058 0.367394 -0.666095
H  -0.19907 0.099644 -0.945803
H  0.699367 0.292907 1.994947
H  0.399849 1.706862 0.936989
H  -2.721019 -0.552925 -1.1353
H  -2.552109 1.221869 -1.032081
H  -1.771186 0.602594 1.449745
H  -4.122081 1.21088 0.9835
H  -4.313996 -0.548459 0.792235
H  -5.257126 -0.182107 -1.533007
H  -5.041229 1.5707 -1.350518
H  -7.437005 0.918259 -0.872787
H  -6.892484 -0.189829 0.419382
H  -6.674477 1.572774 0.60504
H  2.711024 -1.161928 1.616416
H  1.924388 2.251295 -0.946357
H  5.035693 -1.322191 0.688248
H  4.236729 2.084937 -1.889784
H  5.805034 0.296644 -1.074617
H  -0.438555 -3.340568 -0.69931
