program: Gaussian 09
title: 000020108
version: EM64L-G09RevD.01
frameworkgroup: C1[X(C7H13N5)]
method: RPBEPBE
basis: SDD
operation: Freq
keyword: #pfreq=noraman
keyword: PBEPBE/SDD
title: #p freq=noraman PBEPBE/SDD
converged: NO YES NO NO
title: Mulliken charges:
elementType: N N N N N C C C C C C C H H H H H H H H H H H H H
charge: -0.331219 -0.331009 -0.117141 -0.102826 -0.102517 -0.304878 -0.305162 0.090982 0.091045 -0.715409 -0.715273 -0.326141 0.229962 0.230964 0.230897 0.229876 0.329622 0.329679 0.223079 0.222273 0.228651 0.223083 0.222258 0.228639 0.240562
chargesum: 0.00000
title: Mulliken charges with hydrogens summed into heavy atoms:
elementType: N N N N N C C C C C C C
charge: -0.001596 -0.001330 -0.117141 -0.102826 -0.102517 0.156048 0.155612 0.090982 0.091045 -0.041406 -0.041292 -0.085579
polarizability: 1.55243693e+02 -4.51187257e-03 1.25927322e+02 1.80256904e-01 7.88262659e-04 6.56793716e+01
1716.lowfreq: -22.7511 -18.9173 -5.4511 -4.8623 -0.0005 0.0001 0.0003 5.5035 81.5286
frequency: -21.8820 -18.6401 81.5284 82.1046 129.1120 161.6184 195.9286 199.9064 262.6526 264.9680 301.9333 330.6062 423.5217 456.4139 484.0502 535.5648 536.6460 622.6118 641.9813 713.9327 776.2848 792.5975 792.8331 799.6043 895.7695 912.4191 944.3135 961.1402 1005.3278 1063.8190 1097.7942 1141.6310 1144.7776 1145.4973 1156.4713 1203.6416 1209.2631 1257.2471 1259.2179 1317.2831 1331.5551 1343.1101 1391.4592 1396.9783 1397.9200 1401.4591 1471.6378 1477.8811 1478.0015 1479.3617 1485.2515 1495.5181 1499.8913 1507.4541 1534.8888 1587.5691 2982.5922 2982.9416 2983.8043 2985.1392 3023.8646 3024.6683 3078.0248 3078.1929 3092.7966 3093.0887 3151.8802 3562.5624 3563.6796
redmass: 2.2140 2.0040 3.3281 2.8022 3.0756 3.8622 3.3926 3.3022 1.2948 1.3810 2.9485 3.6195 5.1624 2.9889 4.0905 1.0992 1.1676 7.6653 6.4580 10.1208 4.3861 1.2078 1.1171 5.8933 7.3181 1.7403 2.2908 1.4453 4.9569 2.3921 3.1080 3.9114 1.5263 1.5234 3.1362 4.1045 2.9618 1.1007 1.1011 1.8554 1.5763 1.3698 2.4526 1.2670 1.2406 1.3302 1.8324 1.0405 1.0404 1.0694 1.2697 1.1349 1.0771 2.6459 6.2955 7.0789 1.0466 1.0403 1.0489 1.0555 1.1035 1.1036 1.1011 1.1011 1.0985 1.0985 1.0928 1.0772 1.0772
irintensity: 0.0026 0.3154 0.4938 0.0605 11.9251 0.7266 2.0725 0.0002 1.4857 0.0020 0.1308 2.8262 18.5498 8.9388 0.2669 17.2677 163.3396 1.3323 0.0824 0.0001 5.4765 21.4680 0.0604 18.7975 16.0126 0.3133 0.6784 11.3395 1.2222 1.4943 0.0060 33.5686 0.0848 3.2636 3.7949 7.0440 6.0204 0.0131 0.2014 18.3501 51.4391 78.1886 15.7728 33.5245 14.5383 26.1939 112.5369 6.6719 19.3438 45.0352 0.3852 168.8389 0.3757 51.8423 1165.4414 357.0327 28.7404 15.1096 35.5035 36.3568 9.8345 18.0036 5.2693 96.2617 14.4893 47.2647 30.0309 112.0600 16.1005
temp: 298.150 k
press: 1.00000 atm
elementType: 7 7 7 7 7 6 6 6 6 6 6 6 1 1 1 1 1 1 1 1 1 1 1 1 1
symmnumber: 1
zpe: 545408.5 jmol-1
zpe.correction: 0.207735 hartree
zpe.thermalcorrener: 0.218709 hartree
zpe.thermalcorrenthalpy: 0.219653 hartree
zpe.thermalcorrgfe: 0.170743 hartree
zpe.sumelectzpe: -547.397284 hartree
zpe.sumelectthermal: -547.386310 hartree
zpe.sumelectthermalent: -547.385366 hartree
zpe.sumelectthermalfe: -547.434276 hartree
dipole: 0.0001 -3.5792 0.0007
dipole: 3.5792
quadrupole: -57.2407 -73.8161 -73.6760
quadrupole: 0.0047 0.0598 0.0003
quadrupole: 11.0036 -5.5718 -5.4317 0.0047 0.0598 0.0003
hfenergy: -547.6050187 hartree
pointgroup: C01 [X(C7H13N5)]
dipole: -0.0062372 1.4081373 -0.000401 debye
dipolederiv: -1.3249532 0.6323185 0.0007776 0.6129812 -0.6561945 -0.0029201 -0.004611 0.0014812 -0.4663586 -1.3139899 -0.6382937 0.0007606 -0.6185074 -0.6672482 0.0030491 -0.0047637 -0.001486 -0.4663185 -1.6754715 -0.0053123 0.0032025 -0.0057352 -0.447797 -0.0000091 0.0037947 0.0000408 -0.2145896 -1.0579954 -0.0876031 0.0018724 -0.6537255 -1.0236647 0.0015626 0.0025936 0.0006758 -0.2170699 -1.0644926 0.0870525 0.0018968 0.653404 -1.0167437 -0.0014041 0.002546 -0.0006211 -0.2169537 0.2582247 -0.0878385 0.0006376 -0.3375272 0.6331913 0.0041582 0.0028681 0.0019626 0.3095711 0.2542749 0.0845085 0.0006881 0.3341946 0.6372439 -0.0043399 0.0029336 -0.002041 0.3099318 1.9553909 -0.5502574 -0.003962 -0.5587593 0.9650378 0.0016133 -0.0047114 0.0015673 0.2044291 1.9458906 0.5587469 -0.0040761 0.5673961 0.9752311 -0.0017548 -0.0048453 -0.0017149 0.2045217 -0.0258625 0.0541144 -0.0023277 0.0996453 -0.0087974 -0.0002128 -0.0020558 -0.0008167 0.0942885 -0.0242982 -0.0541576 -0.002349 -0.0997477 -0.0100057 0.0002276 -0.0020716 0.0008551 0.0943463 1.3049689 0.0027745 -0.0031278 0.0027046 0.7150899 -0.0000338 -0.0029214 -0.0000275 -0.0282627 0.0112112 -0.0423288 -0.0881504 0.0703683 -0.0518574 -0.0458978 -0.0586308 -0.0917653 -0.0688337 0.0096148 -0.0451027 0.0884734 0.0653077 -0.0480231 0.0442329 0.0600588 0.0884471 -0.0616908 0.0097569 0.0456592 0.0888682 -0.064847 -0.0484754 -0.0436359 0.0607372 -0.08819 -0.0617831 0.0113992 0.0428543 -0.088591 -0.070017 -0.0524159 0.0453229 -0.0592718 0.0915779 -0.0690932 0.2402946 -0.0265354 0.0007248 0.0237474 0.1256488 -0.0000753 0.0021026 -0.000226 0.3116758 0.2403162 0.0275235 0.0007767 -0.0226309 0.1256885 0.0001031 0.0023012 0.000285 0.3115664 0.0106881 -0.0141748 -0.0716117 -0.0880458 0.0770806 -0.0929652 -0.1117074 -0.0670435 -0.0773892 0.0050984 -0.0159267 0.0738176 -0.0911842 0.0752686 0.0926653 0.1135631 0.0681242 -0.0722287 0.0639188 0.0130037 -0.0002657 0.0801463 -0.1622301 -0.0003069 0.0001589 -0.0009428 0.1137238 0.0098732 0.013612 -0.0723782 0.0874452 0.077927 0.0923496 -0.112288 0.0660606 -0.0774458 0.0041812 0.0153633 0.0745956 0.0906073 0.0760549 -0.0921011 0.1141306 -0.067214 -0.072194 0.0647059 -0.0110175 -0.000263 -0.0781966 -0.1629177 0.0003658 0.0001833 0.0010178 0.1136901 0.0872545 0.001017 0.0000107 0.0009756 -0.1270915 0.0000064 -0.0000934 -0.0000065 0.1024672 unknown
polarizability: 155.2431451|0.1354013|125.9279457|-0.1600539|-0.0061166|65.6792954 unknown
InChI: InChI=1S/C7H13N5/c1-3-8-6-10-5-11-7(12-6)9-4-2/h5,8-9H,3-4H2,1-2H3
charge 0 multiplicity 1
25 atoms
N  -2.353977 0.106857 0.006033
N  2.348625 0.127974 -0.005572
N  -0.003337 0.2041 0.00029
N  1.224278 -1.923632 -0.002562
N  -1.211822 -1.934863 0.00333
C  -2.492379 1.571319 0.00811
C  2.475274 1.592868 -0.008134
C  -1.153519 -0.547166 0.003342
C  1.153757 -0.536484 -0.002611
C  -3.978371 1.967402 -0.010636
C  3.95812 2.001432 0.010643
C  0.008962 -2.53595 0.000411
H  -1.98815 1.987768 0.901659
H  -1.964321 1.990752 -0.869775
H  1.943957 2.008802 0.86953
H  1.967982 2.005487 -0.901815
H  -3.183194 -0.489519 0.009284
H  3.182366 -0.462148 -0.009063
H  -4.484044 1.583198 -0.915873
H  -4.508497 1.578145 0.878421
H  -4.077634 3.066619 -0.008571
H  4.466823 1.621499 0.915983
H  4.491494 1.616248 -0.878249
H  4.048045 3.101428 0.008329
H  0.014163 -3.630836 0.000397
