program: Gaussian 09
title: 000248273
version: EM64L-G09RevD.01
frameworkgroup: C1[X(C21H29ClO2)]
method: RPBEPBE
basis: SDD
operation: Freq
keyword: #p
keyword: freq=noraman
keyword: PBEPBE/SDD
title: #p freq=noraman PBEPBE/SDD
converged: NO YES NO NO
title: Mulliken charges:
elementType: Cl O O C C C C C C C C C C C C C C C C C C C C C H H H H H H H H H H H H H H H H H H H H H H H H H H H H H
charge: 0.086215 -0.440099 -0.434759 -0.177598 0.355097 -0.170444 -0.090949 0.260109 -0.525291 -0.541779 0.054644 -0.525834 -0.517743 -0.498137 0.501100 -0.800278 -0.506309 -0.481587 -0.830765 -0.682529 -0.466358 -0.066896 0.423474 -0.567433 0.231203 0.247873 0.197888 0.222402 0.196233 0.227894 0.215911 0.221037 0.224982 0.251124 0.235155 0.220733 0.215140 0.221179 0.235990 0.225486 0.210037 0.213512 0.211635 0.219480 0.227576 0.223637 0.242212 0.197257 0.189104 0.227275 0.234719 0.337493 0.319984
chargesum: 0.00000
title: Mulliken charges with hydrogens summed into heavy atoms:
elementType: Cl O O C C C C C C C C C C C C C C C C C C C C C
charge: 0.086215 -0.102606 -0.114775 0.053605 0.355097 0.077428 0.106939 0.260109 -0.106656 -0.097973 0.054644 -0.079816 -0.031464 -0.062264 0.501100 -0.117624 -0.082760 -0.269952 -0.160072 -0.243061 -0.049979 0.167823 0.423474 -0.567433
polarizability: 2.68657803e+02 -5.52293556e+00 2.19640802e+02 -8.18720043e+00 -7.88926135e-01 2.02529412e+02
1716.lowfreq: -4.9509 0.0016 0.0026 0.0027 0.7700 10.9163 23.1449 39.5570 52.0557
frequency: 23.0448 39.0936 52.0370 63.4701 90.4466 99.9842 117.8745 123.8025 172.4760 182.6120 195.3333 206.3430 222.1292 231.3392 245.9383 256.1348 269.3064 270.7038 278.4583 284.0035 291.3042 296.4582 307.4679 312.2879 320.9345 345.1887 356.3824 396.7825 401.0190 405.3914 417.3546 442.7333 453.2920 463.4677 479.3502 492.7414 520.5559 554.6343 570.0674 586.1748 604.2187 630.9742 651.6210 692.2778 715.2969 733.3653 794.1018 800.7987 812.4635 834.9862 836.1881 837.5935 878.7410 882.4225 910.4637 916.2066 934.3224 948.2634 962.2090 970.2448 977.7595 984.5257 991.4872 999.5060 1007.2873 1018.2334 1020.4260 1030.9353 1043.4553 1067.6646 1072.8180 1085.3812 1108.7476 1119.8609 1123.5966 1126.1006 1137.3969 1138.6515 1150.3576 1164.7274 1167.8475 1184.0665 1190.4495 1194.5702 1209.5897 1222.7253 1226.8857 1245.3743 1250.1546 1268.4830 1270.7303 1272.3206 1274.4915 1295.5600 1299.7559 1304.3343 1308.2549 1321.6170 1325.6706 1328.7644 1331.6797 1337.7781 1342.5873 1346.3431 1352.7648 1358.6091 1365.7949 1375.6559 1388.0617 1395.5428 1453.6562 1456.4988 1457.8525 1458.2113 1464.8749 1467.5792 1471.0993 1473.6985 1480.6310 1488.8443 1489.6864 1495.6726 1682.7283 2247.9088 2919.4983 2923.5239 2929.4190 2934.5979 2961.8155 2964.0943 2967.1338 2975.6551 2981.1331 2990.3818 2992.6017 2997.4988 3002.0692 3019.5950 3029.2388 3029.4182 3034.4276 3042.5475 3045.7985 3054.9924 3056.2485 3072.2379 3078.7553 3084.3220 3087.9444 3091.2067 3096.6998 3538.8622 3543.3772
redmass: 8.6771 4.8466 5.7345 3.3226 2.7897 1.9695 3.7918 3.3767 1.8584 1.9579 3.0606 2.2182 3.1241 3.2122 1.7143 3.1076 2.8007 2.5613 2.0102 2.0278 2.1910 2.4558 2.2908 2.8730 2.3281 2.4755 2.4958 3.4727 3.3642 3.6753 3.8651 3.3661 1.9913 4.7479 3.8324 2.6908 3.1054 4.2444 4.2449 3.0422 3.8338 3.6019 3.3229 3.3453 3.0035 2.7098 1.9720 1.7638 1.8381 1.9210 2.2728 1.8489 2.0402 1.7862 2.0153 1.9934 1.7035 1.9346 2.1201 2.8334 2.4979 2.3614 2.3684 2.4203 2.6432 2.2153 2.0740 1.8282 1.9893 2.0707 2.2411 2.4815 1.8242 2.1718 2.0950 2.0383 2.2191 1.9812 1.4956 1.7177 1.9677 1.8614 1.5111 2.3346 1.8001 1.3982 1.6442 1.3699 1.4154 1.5546 1.4068 1.4273 1.4486 1.3927 1.3753 1.6358 1.5343 1.3966 1.3325 1.4011 1.4128 1.4733 1.4387 1.6183 1.3994 1.4506 1.5136 1.2351 1.2341 1.1947 1.0852 1.0758 1.0879 1.0721 1.0755 1.0774 1.0784 1.0838 1.0650 1.0656 1.0756 1.0616 7.7815 12.0096 1.0820 1.0800 1.0664 1.0670 1.0599 1.0659 1.0609 1.0817 1.0382 1.0579 1.0649 1.0443 1.0834 1.1001 1.0623 1.0868 1.0961 1.0949 1.1004 1.0958 1.1010 1.0989 1.0972 1.0903 1.0987 1.1000 1.1025 1.0657 1.0660
irintensity: 0.1754 0.2304 0.6826 0.3575 0.6959 2.2549 0.3581 0.6295 0.3071 2.7883 1.0257 0.8804 2.0801 2.4217 3.3103 20.4774 2.9996 1.3982 14.4382 57.4032 26.2692 9.0565 26.6716 38.3559 53.0639 55.2803 1.2422 0.3234 2.3495 5.2659 0.8109 1.3455 3.9077 6.2684 0.9249 2.8403 0.3903 6.1964 2.9092 0.3562 1.8061 10.4247 6.1317 5.1573 4.6444 1.9796 2.1746 8.2256 26.8608 19.0351 3.0017 3.2751 2.0611 1.2175 14.4763 2.9995 3.8703 41.1323 40.5143 23.6123 69.5847 7.3909 0.6323 72.7036 7.3140 7.6794 19.2544 11.5042 22.8730 7.0462 4.7788 1.1208 3.4956 3.0056 7.3746 2.3505 9.0470 8.1933 2.1870 4.8895 21.3825 2.7574 7.5226 8.5908 0.0655 3.5486 4.2975 0.0150 4.7955 12.0440 29.0138 10.4648 16.7184 3.4427 3.4901 22.0865 7.5609 1.2090 3.7863 1.9012 0.6348 1.8894 0.5924 1.5195 1.2021 5.0716 3.1125 35.5155 18.9604 28.6445 13.8230 1.9821 8.6258 2.0820 3.8923 12.2951 4.0224 5.3216 25.9156 3.2744 7.9934 11.5955 2.6936 41.0538 0.2579 21.0220 37.5001 35.8841 44.4712 14.6351 40.9974 16.5948 24.3356 25.7406 23.5897 21.5543 63.8272 17.6158 24.2238 9.6467 56.4885 32.9064 44.4888 50.0188 24.4519 28.6586 48.5236 51.0543 23.7306 42.3214 15.6567 7.5666 8.2230
temp: 298.150 k
press: 1.00000 atm
elementType: 17 8 8 6 6 6 6 6 6 6 6 6 6 6 6 6 6 6 6 6 6 6 6 6 1 1 1 1 1 1 1 1 1 1 1 1 1 1 1 1 1 1 1 1 1 1 1 1 1 1 1 1 1
symmnumber: 1
zpe: 1186362.3 jmol-1
zpe.correction: 0.451862 hartree
zpe.thermalcorrener: 0.475688 hartree
zpe.thermalcorrenthalpy: 0.476632 hartree
zpe.thermalcorrgfe: 0.400043 hartree
zpe.sumelectzpe: -1426.200548 hartree
zpe.sumelectthermal: -1426.176721 hartree
zpe.sumelectthermalent: -1426.175777 hartree
zpe.sumelectthermalfe: -1426.252366 hartree
dipole: -0.0804 -0.9506 -1.3241
dipole: 1.6320
quadrupole: -174.3135 -155.1217 -146.2064
quadrupole: -15.9367 -6.0387 -2.6939
quadrupole: -15.7663 3.4255 12.3408 -15.9367 -6.0387 -2.6939
hfenergy: -1426.6524091 hartree
pointgroup: C01 [X(C21H29Cl1O2)]
dipole: 0.0620082 -0.2378847 0.5931551 debye
polarizability: 267.5233709|6.3882473|219.6668302|-10.7204221|-3.9664874|203.6378159 unknown
InChI: InChI=1S/C21H29ClO2/c1-19-8-5-15(23)13-14(19)3-4-16-17(19)6-9-20(2)18(16)7-10-21(20,24)11-12-22/h3,15-18,23-24H,4-10,13H2,1-2H3
charge 0 multiplicity 1
53 atoms
Cl 4.673467 3.61183 -1.319515
O  4.691131 -0.728696 1.297728
O  -6.492355 0.93985 -0.457341
C  1.452603 -0.717337 -0.588829
C  2.175736 -0.531206 0.777677
C  -0.063661 -0.965915 -0.467172
C  -0.728998 0.194299 0.341595
C  -2.274177 -0.041666 0.556921
C  1.55775 0.697652 1.482912
C  0.027164 0.511297 1.666279
C  3.674002 -0.392898 0.273132
C  2.319831 -1.76485 -1.338807
C  3.777276 -1.493386 -0.841751
C  -0.709019 -1.06829 -1.868395
C  -2.93168 -0.5057 -0.760729
C  2.091722 -1.782733 1.689867
C  -2.929504 1.320356 0.98041
C  -2.215158 -0.942163 -1.832126
C  -2.541015 -1.116919 1.656556
C  -4.45504 -0.45851 -0.823747
C  -4.475963 1.318601 0.975838
C  -5.017316 0.920054 -0.408201
C  3.964075 0.955462 -0.267196
C  4.260288 2.067827 -0.704747
H  1.567665 0.249814 -1.130588
H  -0.234459 -1.925922 0.062993
H  -0.641167 1.098436 -0.3052
H  1.746592 1.603392 0.873184
H  2.025406 0.868291 2.474627
H  -0.148492 -0.293499 2.403473
H  -0.3868 1.435629 2.112482
H  2.231563 -1.664335 -2.434356
H  1.997385 -2.79096 -1.078268
H  4.233496 -2.384822 -0.377844
H  4.445222 -1.166265 -1.654933
H  -0.427644 -2.028747 -2.345323
H  -0.286199 -0.275314 -2.525644
H  1.046116 -2.030342 1.938368
H  2.547131 -2.672257 1.223403
H  2.635817 -1.603444 2.633347
H  -2.577988 2.107645 0.281333
H  -2.57113 1.603766 1.988165
H  -2.757332 -1.231993 -2.744879
H  -3.601286 -1.423622 1.673799
H  -1.942239 -2.027269 1.473264
H  -2.294032 -0.735277 2.663884
H  -4.805868 -0.707846 -1.841286
H  -4.89411 -1.217142 -0.137532
H  -4.863153 0.606817 1.735516
H  -4.859309 2.319937 1.247332
H  -4.729772 1.68166 -1.155566
H  4.786617 0.04282 1.914204
H  -6.833583 0.273991 0.194191
