program: Gaussian 09
title: 000020111
version: EM64L-G09RevD.01
frameworkgroup: C1[X(C8H18O2)]
method: RPBEPBE
basis: SDD
operation: Freq
keyword: #pfreq=noraman
keyword: PBEPBE/SDD
title: #p freq=noraman PBEPBE/SDD
converged: YES YES NO NO
title: Mulliken charges:
elementType: O O C C C C C C C C H H H H H H H H H H H H H H H H H H
charge: -0.273018 -0.453690 -0.391801 -0.371532 -0.246057 -0.357329 -0.242262 -0.346189 -0.333405 -0.686934 0.206608 0.206369 0.205206 0.205173 0.181443 0.181430 0.209931 0.210188 0.177510 0.177496 0.191628 0.191660 0.188832 0.188878 0.211502 0.211486 0.215142 0.341735
chargesum: 0.00000
title: Mulliken charges with hydrogens summed into heavy atoms:
elementType: O O C C C C C C C C
charge: -0.273018 -0.111956 0.021176 0.038847 0.116816 0.062791 0.112744 0.037099 0.044305 -0.048803
polarizability: 1.29787497e+02 4.65146971e-01 8.37924772e+01 -5.33601015e-03 -8.92268226e-03 7.70460178e+01
1716.lowfreq: -0.0007 -0.0001 0.0006 6.9333 7.9126 25.8923 32.7584 52.8171 52.9453
frequency: 30.4075 52.4698 52.8897 77.1353 99.1250 120.0377 133.3169 133.6696 151.0454 224.7627 231.7630 242.2422 274.8421 361.0723 396.8400 476.6460 515.0016 741.6636 767.4944 806.5671 818.3031 886.4370 925.7104 929.8758 939.6678 965.7807 1008.4598 1027.8715 1055.5500 1069.1667 1080.5443 1092.4337 1127.3569 1131.9658 1150.2924 1172.0839 1211.2675 1212.8769 1247.4490 1265.8235 1271.0375 1274.9792 1276.7955 1282.8652 1287.9083 1335.4808 1347.8831 1364.0630 1391.9752 1410.8114 1418.1974 1468.7847 1471.4592 1472.2299 1476.0063 1477.8124 1480.8704 1487.0690 1490.9059 1496.4204 2898.1273 2909.6512 2930.2568 2947.2765 2949.7594 2965.6421 2975.2357 2977.4116 2985.6681 2991.5858 2994.4469 3008.4361 3035.4686 3054.0432 3064.6616 3073.4568 3074.2741 3565.9786
redmass: 4.5157 1.6304 4.1117 3.4089 1.8174 2.8116 1.9587 3.7050 2.8274 4.8698 1.1239 3.4703 1.0842 2.9749 4.9406 3.1364 3.7361 1.0737 1.0706 1.1285 1.1359 2.6186 2.8806 1.1708 1.1506 7.8365 3.2107 3.5006 3.5295 4.5865 2.2959 2.3362 2.6119 1.4558 1.4344 1.2687 1.3693 1.2779 1.2656 1.2693 1.1472 1.3135 1.0758 1.0868 1.1443 1.2929 1.5180 1.5394 1.2177 1.5054 1.4360 1.0774 1.0773 1.0702 1.0723 1.0418 1.0761 1.0794 1.0915 1.0867 1.0547 1.0545 1.0547 1.1051 1.1059 1.0588 1.0364 1.1065 1.0598 1.0593 1.0584 1.1004 1.1028 1.1038 1.1051 1.1010 1.0995 1.0664
irintensity: 0.0146 5.5116 0.9114 0.5064 12.7480 3.7049 0.0021 3.7760 1.0090 0.1593 0.0374 1.1528 162.0653 0.7026 3.5553 6.6927 27.2171 8.9009 6.9400 0.0962 0.0848 14.9684 3.5156 0.5046 0.2724 73.3959 12.3986 35.4635 19.2701 143.3116 14.3952 2.2166 7.2221 0.2283 0.8886 6.0292 0.3131 18.2747 0.4376 13.5293 0.0112 11.0197 0.0301 0.0496 2.5606 24.7542 2.4241 29.1562 8.0950 0.1878 6.5642 2.3163 0.8061 0.4716 5.0052 12.5975 3.9125 12.0690 1.6741 12.3083 24.3881 108.9399 65.7582 83.2237 26.3131 38.2948 32.8360 48.9833 0.3917 35.4930 77.0958 7.3574 0.0404 24.1045 99.6946 104.1172 53.2890 2.2525
temp: 298.150 k
press: 1.00000 atm
elementType: 8 8 6 6 6 6 6 6 6 6 1 1 1 1 1 1 1 1 1 1 1 1 1 1 1 1 1 1
symmnumber: 1
zpe: 655510.8 jmol-1
zpe.correction: 0.249671 hartree
zpe.thermalcorrener: 0.263397 hartree
zpe.thermalcorrenthalpy: 0.264342 hartree
zpe.thermalcorrgfe: 0.207787 hartree
zpe.sumelectzpe: -465.207050 hartree
zpe.sumelectthermal: -465.193323 hartree
zpe.sumelectthermalent: -465.192379 hartree
zpe.sumelectthermalfe: -465.248934 hartree
dipole: 0.1873 -0.3882 0.0108
dipole: 0.4312
quadrupole: -58.5389 -64.2562 -63.3129
quadrupole: 12.2809 -0.0561 0.0013
quadrupole: 3.4971 -2.2202 -1.2769 12.2809 -0.0561 0.0013
hfenergy: -465.4567204 hartree
pointgroup: C01 [X(C8H18O2)]
dipole: 0.0743154 -0.1524466 0.0034788 debye
polarizability: 129.7829574|0.6496693|83.7968438|0.0593606|0.0290372|77.0461912 unknown
InChI: InChI=1S/C8H18O2/c1-2-3-7-10-8-5-4-6-9/h9H,2-8H2,1H3
charge 0 multiplicity 1
28 atoms
O  0.612112 -0.232552 0.002792
O  -5.571442 0.185966 -0.004938
C  -1.804544 -0.408163 -0.002224
C  3.036952 -0.329793 0.004395
C  -0.620199 0.563207 0.006661
C  -3.161618 0.330757 0.000009
C  1.820609 0.600921 0.009646
C  4.375793 0.444016 0.009964
C  -4.348112 -0.636222 -0.003463
C  5.601157 -0.495201 0.005763
H  -1.719107 -1.056751 -0.895776
H  -1.722645 -1.068876 0.882775
H  2.981273 -0.98232 -0.888407
H  2.980397 -0.993569 0.888803
H  -0.652035 1.213522 0.911458
H  -0.649317 1.2267 -0.888599
H  -3.243691 0.98183 0.892067
H  -3.243601 0.987331 -0.888002
H  1.827618 1.25249 0.914314
H  1.829325 1.264957 -0.885887
H  4.417888 1.102725 0.901631
H  4.41946 1.112774 -0.874116
H  -4.30716 -1.285724 -0.905527
H  -4.310873 -1.287913 0.897158
H  5.59822 -1.152733 0.895331
H  5.598305 -1.144455 -0.889886
H  6.548148 0.074964 0.008437
H  -6.365614 -0.405788 -0.006177
