program: Gaussian 09
title: 000248224
version: EM64L-G09RevD.01
frameworkgroup: C1[X(C13H21N5O2)]
method: RPBEPBE
basis: SDD
operation: Freq
keyword: #p
keyword: freq=noraman
keyword: PBEPBE/SDD
title: #p freq=noraman PBEPBE/SDD
converged: YES YES NO NO
title: Mulliken charges:
elementType: O O N N N N N C C C C C C C C C C C C C H H H H H H H H H H H H H H H H H H H H H
charge: -0.282136 -0.270167 -0.174189 -0.125036 -0.162485 -0.080484 -0.221709 0.183865 -0.457982 0.138133 0.067046 -0.316025 -0.302922 0.131129 -0.646064 0.197646 -0.616572 -0.681186 -0.681670 -0.602014 0.215427 0.237942 0.237988 0.189126 0.211787 0.187347 0.273045 0.285095 0.233288 0.245069 0.270916 0.245841 0.226516 0.207163 0.215646 0.223693 0.210877 0.218717 0.268160 0.249805 0.249375
chargesum: 0.00000
title: Mulliken charges with hydrogens summed into heavy atoms:
elementType: O O N N N N N C C C C C C C C C C C C C
charge: -0.282136 -0.270167 -0.174189 -0.125036 -0.162485 -0.080484 -0.221709 0.183865 -0.004613 0.138133 0.067046 0.111089 0.096212 0.131129 0.145363 0.197646 0.145254 -0.031861 -0.028383 0.165326
polarizability: 2.50185089e+02 -2.16557349e+00 1.85807776e+02 1.40056955e+01 4.92683470e+00 1.27525784e+02
1716.lowfreq: -2.2039 -0.0008 -0.0005 0.0002 5.1596 6.7039 25.9768 35.6850 48.4614
frequency: 25.9707 35.6534 48.4294 72.5535 75.1307 79.4098 92.7328 108.2237 124.1770 132.2649 134.0247 141.0635 167.2952 190.9351 220.1441 232.0711 240.7794 246.2822 281.9845 290.8448 296.8573 320.8977 339.4850 358.9687 381.4834 386.6775 411.1620 425.1041 453.8632 475.1019 498.7656 534.1231 628.6288 655.6761 680.9624 704.6948 717.6719 745.6932 752.1782 777.2551 789.3014 800.9147 804.5849 903.7627 942.2984 960.5015 982.6775 986.8595 1030.5782 1054.7074 1058.7511 1072.7920 1086.1240 1109.1164 1130.6774 1132.3350 1134.6080 1155.2606 1162.9506 1192.9917 1193.8830 1213.2654 1227.8264 1239.0490 1271.0497 1280.0942 1287.5448 1300.0175 1348.6313 1362.6566 1364.4850 1373.7987 1389.4795 1390.7569 1391.7759 1413.6844 1426.5815 1445.4021 1457.3523 1463.8349 1466.8028 1470.0698 1472.5276 1474.5919 1475.2071 1477.5584 1478.6919 1478.9900 1483.0101 1486.7989 1492.1393 1497.3043 1509.0388 1571.7548 1612.8283 1647.2899 2860.8765 2874.5228 2913.1689 2981.9951 2986.1055 2991.4668 3006.4143 3012.4776 3027.7749 3034.5067 3044.7022 3074.8983 3079.6553 3085.8766 3088.3023 3091.1059 3094.9417 3104.2492 3128.9676 3138.2756 3138.4067
redmass: 3.6130 4.0267 3.3238 1.1656 1.8915 2.0996 3.7415 2.9554 1.1435 1.8232 1.3999 3.1362 3.2981 1.3994 1.5585 3.1808 4.7506 2.9328 2.4056 2.2802 2.4895 4.2880 3.0180 3.2664 7.5136 8.4076 5.4959 3.6602 4.0008 3.2531 5.5556 5.3091 5.4014 8.9738 7.7758 10.9201 5.5700 10.5348 3.1248 4.4962 2.0949 1.2788 1.5872 1.9655 2.8732 4.7767 2.0359 2.3700 2.7888 2.9791 2.5224 1.8766 2.1735 1.9410 1.2975 1.3046 1.3130 1.9399 2.2439 2.7865 2.4847 4.9791 2.6148 1.7242 4.8779 1.1423 1.1935 6.6844 1.6947 1.6929 1.7316 1.4152 1.9024 1.2247 1.2859 1.2975 1.2522 2.1953 1.1055 1.7852 1.1838 1.0659 1.1823 1.0694 1.0818 1.0443 1.0627 1.0621 1.1352 1.1340 1.1003 1.4651 1.9785 7.8892 10.6670 9.9352 1.0723 1.0713 1.0686 1.0363 1.0358 1.0355 1.0336 1.0328 1.0888 1.0887 1.0884 1.0978 1.0978 1.0997 1.1004 1.1004 1.1024 1.1021 1.1030 1.1023 1.1012
irintensity: 0.0626 0.1296 0.1588 0.1660 0.1384 0.1574 0.2304 0.1076 0.9052 12.8532 6.1216 0.4900 1.8609 0.5852 2.9770 15.5999 0.8254 1.0730 0.4340 1.0906 1.5750 2.0444 9.4919 5.1479 5.4173 18.5438 7.7438 0.7290 12.7686 2.1668 18.4733 0.8789 4.4312 3.4302 3.8034 7.9481 4.6772 13.8368 9.0655 3.7352 4.5629 6.5040 4.2110 2.3183 3.3352 39.9530 1.6485 9.7855 89.8172 13.6991 39.0204 20.4414 2.9183 24.0808 0.4848 0.0228 3.3483 1.7921 21.6013 12.7359 53.6409 44.6222 4.8862 10.5009 52.6812 13.1606 18.9238 46.9003 14.9001 10.1976 3.6236 0.9043 14.5632 22.8569 28.6311 12.2011 51.9647 209.3271 15.4536 8.8017 9.6111 2.0290 34.1539 17.0739 14.5513 15.9597 12.7233 2.0650 22.4430 3.8185 22.9799 73.0626 61.2332 8.0568 620.4106 405.5194 61.8444 127.3556 69.6981 20.6336 27.5425 38.0131 35.9872 30.3033 13.4188 8.6123 6.4956 52.1691 63.9298 9.2852 31.9124 48.0666 18.6639 17.7575 3.5461 0.8312 0.5674
temp: 298.150 k
press: 1.00000 atm
elementType: 8 8 7 7 7 7 7 6 6 6 6 6 6 6 6 6 6 6 6 6 1 1 1 1 1 1 1 1 1 1 1 1 1 1 1 1 1 1 1 1 1
symmnumber: 1
zpe: 889252.9 jmol-1
zpe.correction: 0.338699 hartree
zpe.thermalcorrener: 0.360349 hartree
zpe.thermalcorrenthalpy: 0.361293 hartree
zpe.thermalcorrgfe: 0.287354 hartree
zpe.sumelectzpe: -930.684771 hartree
zpe.sumelectthermal: -930.663120 hartree
zpe.sumelectthermalent: -930.662176 hartree
zpe.sumelectthermalfe: -930.736115 hartree
dipole: -5.3578 -0.6363 -0.7444
dipole: 5.4466
quadrupole: -121.3006 -124.8955 -117.3383
quadrupole: 0.8874 0.5224 -2.5401
quadrupole: -0.1225 -3.7174 3.8398 0.8874 0.5224 -2.5401
hfenergy: -931.0234691 hartree
pointgroup: C01 [X(C13H21N5O2)]
dipole: 2.1129299 -0.0693133 0.3500343 debye
polarizability: 249.4691398|8.9425105|180.2490169|14.0012313|-18.0422055|133.8004926 unknown
InChI: InChI=1S/C13H21N5O2/c1-6-18(7-2)8-9-14-11-10(15(9)3)12(19)17(5)13(20)16(11)4/h6-8H2,1-5H3
charge 0 multiplicity 1
41 atoms
O  -1.939337 2.4349 -1.020819
O  -4.500342 -1.366204 0.092397
N  0.48191 0.872515 0.211324
N  3.439713 -0.157474 -0.054809
N  -2.211376 -1.428138 0.609134
N  0.217961 -1.240958 1.042636
N  -3.199282 0.511756 -0.436855
C  1.0999 -0.222475 0.801564
C  2.561156 -0.277598 1.146513
C  -0.87509 0.542034 0.065575
C  -0.997549 -0.756475 0.588205
C  3.306558 -1.346297 -0.950351
C  4.855386 0.11182 0.330293
C  -1.976948 1.272247 -0.506291
C  1.113809 2.153893 -0.156261
C  -3.369072 -0.801272 0.093016
C  -2.302962 -2.79104 1.165907
C  3.763743 -1.063236 -2.39299
C  5.099838 1.554103 0.812881
C  -4.428745 1.135875 -0.97799
H  2.810543 0.553349 1.832491
H  2.724062 -1.228887 1.704762
H  2.239591 -1.633253 -0.964732
H  3.86382 -2.223176 -0.535119
H  5.477815 -0.065032 -0.564169
H  5.204083 -0.613118 1.109371
H  2.113609 1.939704 -0.566601
H  0.475702 2.65978 -0.895743
H  1.205879 2.806695 0.730884
H  -1.633831 -3.471185 0.612682
H  -3.347526 -3.120338 1.068133
H  -2.001488 -2.788132 2.226853
H  3.192136 -0.218412 -2.815524
H  4.838528 -0.813698 -2.453134
H  3.594411 -1.953381 -3.026494
H  4.789751 2.276324 0.037201
H  4.551045 1.789407 1.743085
H  6.174906 1.706774 1.020888
H  -4.153931 2.135472 -1.344923
H  -5.194268 1.208253 -0.188394
H  -4.836309 0.521578 -1.797491
