program: Gaussian 09
title: 000248210
version: EM64L-G09RevD.01
frameworkgroup: C1[X(C6H10N4O)]
method: RPBEPBE
basis: SDD
operation: Freq
keyword: #p
keyword: freq=noraman
keyword: PBEPBE/SDD
title: #p freq=noraman PBEPBE/SDD
converged: NO YES NO NO
title: Mulliken charges:
elementType: O N N N N C C C C C C H H H H H H H H H H
charge: -0.339609 -0.394625 -0.400326 -0.097379 -0.619503 0.072599 -0.336996 0.257120 0.086155 -0.655047 -0.211786 0.211252 0.262020 0.269141 0.298100 0.239972 0.197563 0.218335 0.256944 0.315149 0.370921
chargesum: 0.00000
title: Mulliken charges with hydrogens summed into heavy atoms:
elementType: O N N N N C C C C C C
charge: -0.339609 -0.125484 -0.102226 -0.097379 0.066566 0.072599 0.136275 0.257120 0.086155 0.000822 0.045159
polarizability: 1.43752079e+02 -3.38225596e+00 1.05370968e+02 -6.77471551e+00 1.84405098e+00 5.34659970e+01
1716.lowfreq: -14.0832 -1.6044 -0.0006 -0.0005 -0.0002 10.6403 14.0341 60.0604 71.6394
frequency: 3.4795 60.0076 71.5662 136.6871 174.2318 217.0588 272.3925 294.2482 325.8575 386.4157 424.1665 429.6431 436.5770 501.2959 521.0018 604.0194 658.9690 673.9621 700.6052 745.5917 751.6366 789.8521 831.0870 884.4421 911.1460 979.9181 1036.0339 1081.8646 1114.4625 1132.5744 1167.8349 1184.8503 1273.2720 1280.2724 1320.5556 1349.7119 1370.3305 1385.7160 1426.3873 1453.1503 1464.3391 1472.4562 1477.7095 1487.1331 1547.2683 1578.6491 1631.8184 2980.0539 2989.0513 3065.0201 3084.7928 3097.9777 3235.7157 3462.9610 3551.9461 3604.0492 3677.9690
redmass: 2.5529 4.8377 3.2556 2.7553 6.0935 1.2628 3.1182 4.3007 2.9468 1.6740 1.3343 4.4331 2.1472 3.1093 1.4874 2.5448 1.1018 7.6664 4.5803 5.4905 1.9278 1.5204 2.1393 2.1699 6.7068 2.4190 2.8056 1.9970 1.6422 1.6896 3.1209 2.3625 2.2773 1.2444 2.4364 1.7416 1.9125 1.2189 3.3639 1.6158 1.5015 1.1652 1.1317 1.6020 2.3704 2.2581 5.2625 1.0366 1.0667 1.0976 1.0963 1.1013 1.0984 1.0508 1.0768 1.0815 1.0990
irintensity: 0.4024 2.3876 0.5392 0.6861 1.6446 4.3342 2.7770 6.2993 13.7829 37.5233 139.7292 5.8889 7.1980 44.7889 251.1439 20.8721 67.6717 6.5812 0.7094 17.9244 5.2042 36.5241 13.1940 19.8608 9.1599 10.8931 8.7467 8.0079 15.5548 11.2753 108.9567 22.6865 27.8381 38.7352 120.9785 17.3194 104.8102 15.0893 41.3302 94.8411 22.0897 17.7595 19.0159 75.0694 304.6154 96.7830 490.5238 33.0804 64.8283 18.6308 34.0155 32.5918 2.9362 57.7567 10.3315 30.9671 86.1249
temp: 298.150 k
press: 1.00000 atm
elementType: 8 7 7 7 7 6 6 6 6 6 6 1 1 1 1 1 1 1 1 1 1
symmnumber: 1
zpe: 441253.3 jmol-1
zpe.correction: 0.168064 hartree
zpe.thermalcorrener: 0.179372 hartree
zpe.thermalcorrenthalpy: 0.180316 hartree
zpe.thermalcorrgfe: 0.128125 hartree
zpe.sumelectzpe: -528.055980 hartree
zpe.sumelectthermal: -528.044673 hartree
zpe.sumelectthermalent: -528.043729 hartree
zpe.sumelectthermalfe: -528.095920 hartree
dipole: 2.1941 -4.2089 -0.1485
dipole: 4.7488
quadrupole: -66.4183 -52.9380 -68.6790
quadrupole: -4.1959 -0.0643 2.2655
quadrupole: -3.7399 9.7404 -6.0005 -4.1959 -0.0643 2.2655
hfenergy: -528.224045 hartree
pointgroup: C01 [X(C6H10N4O1)]
dipole: -0.8016738 -1.5179991 -0.7372812 debye
dipolederiv: -0.8284186 0.0607722 0.0695247 0.1755189 -0.8069654 -0.2759262 0.1164718 -0.2337576 -0.5431106 -1.4186446 -0.311902 -0.1880272 -0.5348852 -0.5516374 0.0739925 -0.205113 0.108213 -0.4477963 -0.3086763 -0.2444862 -0.110284 -0.3579855 -0.4030561 -0.0546575 -0.1882111 -0.0789911 -0.2315405 -0.3197718 0.1678759 0.0806448 -0.1925697 -0.6639365 -0.145316 -0.0918983 -0.2058602 -0.3647516 -0.2859968 0.0010366 -0.0808778 -0.45053 -1.1563153 -0.178644 -0.2773456 -0.2204377 -0.7470635 -1.3012217 -0.2844026 0.0002424 0.1518171 -0.0232364 0.0223228 0.2541163 0.0937886 -0.1234441 0.7563387 0.037305 0.031359 -0.1975649 0.1485357 -0.1281612 -0.1516489 -0.1714543 0.2237154 2.3243084 0.3471471 -0.0200729 0.278844 0.9346729 0.3787343 -0.0849523 0.3119851 0.4592609 0.428604 -0.0268249 -0.0412227 0.5550889 1.1982339 0.4358883 0.2315308 0.5019453 0.3509445 -0.1026419 -0.000184 -0.0540057 0.04417 0.0764462 0.0652443 -0.0379256 0.0922378 -0.034114 0.287003 0.3483013 0.0976545 0.4516722 0.3615549 0.1425338 0.152953 0.1541392 -0.0229168 -0.1243084 -0.0683737 0.0311117 -0.0910427 -0.0736241 0.1497233 0.0579791 0.1121271 0.0093055 0.1274105 -0.0132031 -0.0442732 0.0887319 0.0420616 -0.0790802 0.0082449 -0.0459811 0.0231376 0.1028898 0.0215817 0.0448671 0.0596407 0.139164 -0.1316981 0.0786116 -0.1592665 0.2311751 0.1574985 -0.0814888 -0.0033581 -0.0461915 0.2090813 -0.0535078 0.0231279 -0.0359687 0.3208973 0.0825239 -0.0857998 0.047564 -0.056892 -0.0503883 0.0997574 0.0166398 0.0758149 0.0186754 0.0979358 0.0309943 0.0013858 -0.0111885 -0.0811936 -0.1485338 -0.0387001 -0.1022126 -0.0459463 -0.2261617 0.0403657 0.0312859 0.0721565 0.1003432 -0.0081703 0.0389051 -0.0228591 0.061639 0.0867122 0.041056 0.0347999 0.0371088 0.0323563 -0.0772082 0.0345969 -0.079403 0.1493232 0.2013176 0.0024531 0.0352977 0.0209677 0.2711191 -0.0553013 0.0416377 -0.0531079 0.3554587 0.2632995 0.0177762 0.036384 0.0031332 0.2967839 -0.0319923 0.0209799 -0.0409513 0.3571512 unknown
polarizability: 143.3619589|7.6326344|95.8946981|-4.1921092|20.4534888|63.3323867 unknown
InChI: InChI=1S/C6H10N4O/c1-2-8-6(11)4-5(7)10-3-9-4/h3,8-9H,2,7H2,1H3
charge 0 multiplicity 1
21 atoms
O  -0.905442 1.314717 1.067575
N  -1.718927 -0.674297 0.14602
N  1.192498 -1.339131 -0.519791
N  2.988084 0.006503 -0.176651
N  1.854644 1.889244 0.877941
C  0.683767 -0.164005 0.102246
C  -3.123959 -0.359371 0.456332
C  -0.676759 0.198579 0.46248
C  1.834325 0.647615 0.302775
C  -3.949702 0.000261 -0.797657
C  2.55904 -1.180579 -0.656794
H  -3.582954 -1.217452 0.985802
H  -3.096448 0.495424 1.152741
H  -1.53415 -1.505688 -0.416284
H  0.66603 -2.171919 -0.773916
H  -3.521547 0.88482 -1.299767
H  -3.973595 -0.834385 -1.523426
H  -4.993164 0.232324 -0.515485
H  3.202268 -1.937042 -1.100973
H  2.731219 2.395532 0.961228
H  0.95687 2.25635 1.208306
