program: Gaussian 09
title: 000248209
version: EM64L-G09RevD.01
frameworkgroup: C1[X(C10H9N3O3)]
method: RPBEPBE
basis: SDD
operation: Freq
keyword: #p
keyword: freq=noraman
keyword: PBEPBE/SDD
title: #p freq=noraman PBEPBE/SDD
converged: YES YES NO NO
title: Mulliken charges:
elementType: O O O N N N C C C C C C C C C C H H H H H H H H H
charge: -0.197757 -0.174634 -0.214091 -0.434110 -0.366033 -0.375218 -0.283242 0.203545 0.128482 0.482042 0.193920 -0.427877 -0.360114 -0.192949 -0.221099 -0.264697 0.295049 0.304664 0.369802 0.372884 0.216855 0.265914 0.224650 0.225003 0.229009
chargesum: 0.00000
title: Mulliken charges with hydrogens summed into heavy atoms:
elementType: O O O N N N C C C C C C C C C C
charge: -0.197757 -0.174634 -0.214091 -0.129446 0.003769 -0.002334 0.011807 0.203545 0.128482 0.482042 0.193920 -0.211022 -0.094200 0.031700 0.003904 -0.035687
polarizability: 2.06995130e+02 -4.39118722e+00 1.19242114e+02 -1.17818879e+01 1.20447748e+01 9.61391336e+01
1716.lowfreq: -7.3145 -3.5804 -0.0006 0.0004 0.0008 8.2726 22.7396 46.1366 47.0201
frequency: 22.6578 46.0546 47.0128 122.3952 131.7954 147.7041 192.5354 195.3125 261.4464 327.6798 351.7760 358.8552 407.5324 429.1820 463.7743 488.3758 504.3909 566.2391 572.6619 607.2874 614.7169 654.2850 683.4960 692.8074 716.9557 752.9527 756.3674 790.3730 822.1929 837.7105 884.8686 904.7718 938.1179 959.2152 979.1100 984.0739 985.9155 1025.3551 1076.2627 1108.1640 1171.9788 1193.2360 1203.1850 1268.0174 1279.7377 1291.1965 1312.1694 1331.1442 1348.2255 1375.5511 1378.0552 1383.2413 1430.9847 1484.0197 1499.0501 1596.1578 1617.4231 1634.4462 1660.9672 1675.8026 3045.1423 3113.3095 3131.0927 3142.2770 3156.7519 3169.8634 3513.9662 3516.5293 3561.4453
redmass: 9.2283 5.4851 5.0347 5.5998 6.2490 10.7417 6.1239 6.5554 3.5211 2.2033 4.7942 3.2261 2.9053 5.7197 9.4878 7.3348 3.0064 5.2307 5.1836 7.7484 6.7705 3.0361 2.5288 1.9171 7.0384 1.6604 1.7252 1.7089 1.3052 4.8595 1.4782 4.3295 3.7501 1.4232 1.9823 2.3447 3.0835 2.2892 2.3026 2.4763 1.0497 1.1174 6.0235 1.5535 1.7595 2.3135 1.8623 1.4412 8.0422 1.7833 1.6358 4.3799 2.1900 1.8826 2.0480 5.1687 6.1259 6.8375 9.8390 5.4121 1.0845 1.0878 1.0862 1.0926 1.0946 1.1012 1.0759 1.0782 1.0770
irintensity: 0.3683 0.3512 0.4980 1.7482 0.8260 9.6530 2.1343 0.8527 6.0383 24.3444 14.0029 81.6373 0.1352 4.3657 11.0757 40.0569 9.5086 13.8373 2.3988 8.0146 3.5205 1.3392 37.1728 37.9043 10.6151 5.7261 83.1749 221.1122 2.8163 16.9034 7.6626 11.6132 4.8407 0.6528 1.1207 0.5691 5.9195 5.3992 22.2960 21.9978 0.8817 3.2238 84.0825 46.0741 34.6827 337.8119 100.2800 21.0079 243.7452 9.3254 3.3596 19.4915 14.1611 21.6146 171.9986 6.5391 147.5244 318.4812 101.8181 616.8754 8.6041 13.2091 0.9507 27.3834 16.8203 17.2915 90.3726 48.8533 21.0819
temp: 298.150 k
press: 1.00000 atm
elementType: 8 8 8 7 7 7 6 6 6 6 6 6 6 6 6 6 1 1 1 1 1 1 1 1 1
symmnumber: 1
zpe: 483873.6 jmol-1
zpe.correction: 0.184298 hartree
zpe.thermalcorrener: 0.197843 hartree
zpe.thermalcorrenthalpy: 0.198787 hartree
zpe.thermalcorrgfe: 0.142339 hartree
zpe.sumelectzpe: -775.287539 hartree
zpe.sumelectthermal: -775.273994 hartree
zpe.sumelectthermalent: -775.273050 hartree
zpe.sumelectthermalfe: -775.329498 hartree
dipole: 0.2635 -0.6102 -1.0570
dipole: 1.2486
quadrupole: -93.8662 -97.6855 -94.1797
quadrupole: 0.4278 4.3433 7.7255
quadrupole: 1.3776 -2.4417 1.0641 0.4278 4.3433 7.7255
hfenergy: -775.4718367 hartree
pointgroup: C01 [X(C10H9N3O3)]
dipole: 0.0883734 0.0377322 0.4817607 debye
dipolederiv: -0.6007096 -0.0841997 -0.1706799 0.0127098 -0.7177361 -0.3598925 -0.2079518 -0.2640397 -0.5847932 -0.5709429 0.0835921 -0.0917282 0.0473776 -1.0763226 0.167776 -0.1204826 0.0690421 -0.3425002 -1.1704377 0.1207183 -0.3411453 0.1412043 -0.5986733 0.0347948 -0.4283155 0.0281219 -0.5475217 -1.5874901 -0.0952566 -0.0031205 -0.088374 -0.4657464 0.078855 -0.0380679 -0.0392609 -0.2072747 -1.2904747 -0.4102097 -0.4482672 -0.1129466 -0.5867687 -0.155092 -0.611393 -0.2852998 -0.6180604 -1.0049692 0.6340624 -0.2005245 0.3373739 -0.9954421 0.1355172 -0.3335056 0.2407269 -0.4237903 0.2737659 -0.0871443 -0.1798219 -0.2237641 0.0459172 -0.0478568 -0.3803713 -0.1253249 0.2783908 1.2997306 0.1008819 0.5496947 -0.3487832 0.6657181 0.3035154 0.6056819 0.4535092 0.6909197 1.2960479 -0.3584622 0.4106453 0.0126344 1.216872 -0.2414141 0.5843563 -0.296503 0.3537183 1.6334975 0.2052074 0.0760574 0.3071812 0.1087788 -0.0456673 0.3904102 0.049281 -0.0148946 1.6342671 -0.0810043 0.5628461 -0.0628357 1.7180457 0.1499495 0.8023614 0.1753395 0.7212423 -0.4540255 -0.0390077 -0.0544829 0.0150113 -0.1856847 0.0830705 0.2043461 0.1267543 0.026965 -0.3459733 -0.0231637 0.0318984 -0.1651033 -0.1855841 0.0917882 -0.3707029 -0.0073326 -0.0942421 0.1689587 0.0503272 0.0388035 0.02278 -0.0751027 0.1086756 -0.0433343 0.0843288 0.1265735 0.2071552 0.0180103 -0.0775249 0.0853453 -0.0778752 0.0981684 0.0521784 0.1080912 0.132908 -0.1106038 0.0343025 0.0454248 0.0288012 -0.2063733 -0.0089095 0.0346423 -0.0011862 -0.2282224 0.1020574 0.0339478 -0.0721615 0.0182885 0.0633917 -0.0011302 0.0354364 0.0216235 0.0026745 0.0754586 -0.0350671 0.029601 0.034455 0.2737938 -0.0486358 -0.0040203 -0.0261797 0.1290281 0.2110864 -0.0005588 -0.0785306 -0.0116623 0.2354241 -0.0366223 -0.1439731 -0.0501352 0.2732846 0.2193092 0.0357729 -0.053126 0.0752072 0.191602 0.0157397 -0.0870156 0.0271583 0.308419 0.0452135 -0.0531377 -0.0880491 -0.0449822 0.1123322 -0.1030541 -0.0599579 -0.0871998 -0.0448723 0.057625 0.0156214 0.0792484 -0.0003835 0.1381071 -0.049958 0.0945404 -0.0264413 0.0550108 -0.0191371 0.0138158 0.1047728 0.0207325 0.139126 -0.0475726 0.1189794 -0.0504955 -0.0253544 0.0585097 -0.0277796 -0.0462013 -0.0471115 0.1100539 -0.0905582 -0.0718432 -0.0915082 -0.0607848 -0.1279189 -0.0512684 -0.0236285 -0.0531558 0.1521465 -0.0314868 -0.0219977 -0.0330699 0.0931766 unknown
polarizability: 205.8592533|6.7580467|105.5082886|13.5593095|17.6450803|111.0088357 unknown
InChI: InChI=1S/C10H9N3O3/c14-8-7(9(15)13-10(16)12-8)11-6-4-2-1-3-5-6/h1-5,7,11-13H
charge 0 multiplicity 1
25 atoms
O  0.881683 -1.790117 -1.547211
O  1.338746 2.826549 -0.344363
O  4.433772 -0.343445 1.095006
N  -0.324611 0.310534 0.498572
N  2.581169 -1.085336 -0.126407
N  2.825249 1.212899 0.419377
C  0.66874 0.463873 -0.56738
C  1.374315 -0.88719 -0.82761
C  1.621549 1.614237 -0.192814
C  -1.689844 0.019708 0.272791
C  3.34973 -0.097404 0.514327
C  -2.622151 0.270211 1.318802
C  -2.152133 -0.526281 -0.955801
C  -3.990585 -0.007584 1.131129
C  -3.529183 -0.781808 -1.133336
C  -4.458336 -0.527271 -0.09942
H  0.156878 0.752348 -1.502459
H  -0.056701 0.599681 1.439468
H  2.992842 -2.024621 -0.145427
H  3.435478 1.952757 0.783826
H  -2.274467 0.695697 2.269025
H  -1.443629 -0.798853 -1.743974
H  -4.695103 0.194047 1.94598
H  -3.871952 -1.203645 -2.084935
H  -5.523057 -0.73639 -0.244567
