program: Gaussian 09
title: 000248214
version: EM64L-G09RevD.01
frameworkgroup: C1[X(C12H12N2O4)]
method: RPBEPBE
basis: SDD
operation: Freq
keyword: #p
keyword: freq=noraman
keyword: PBEPBE/SDD
title: #p freq=noraman PBEPBE/SDD
converged: YES YES NO NO
title: Mulliken charges:
elementType: O O O O N N C C C C C C C C C C C C H H H H H H H H H H H H
charge: -0.262234 -0.239888 -0.219138 -0.219637 -0.398453 0.012579 0.396597 0.158920 -0.548832 0.236756 -0.426541 -0.502787 -0.558971 -0.304970 0.386467 -0.378890 0.250139 -0.504863 0.233357 0.242563 0.276151 0.262842 0.257447 0.315549 0.290752 0.239572 0.285089 0.243911 0.236184 0.240329
chargesum: 0.00000
title: Mulliken charges with hydrogens summed into heavy atoms:
elementType: O O O O N N C C C C C C C C C C C C
charge: -0.262234 -0.239888 -0.219138 -0.219637 -0.082904 0.012579 0.396597 0.158920 -0.072912 0.236756 -0.150390 0.017503 -0.268219 -0.065399 0.386467 -0.093801 0.250139 0.215561
polarizability: 2.06912328e+02 -1.76477141e+01 2.01288977e+02 -1.66106460e+01 -4.16894416e+00 8.85126904e+01
1716.lowfreq: -2.9789 -1.4749 -0.0005 -0.0003 0.0005 5.9617 12.3810 24.9346 45.8604
frequency: 12.3397 24.8777 45.8538 64.1336 68.6717 95.7663 109.4556 141.5560 153.7512 187.2062 194.8211 263.4963 269.4308 285.0879 340.8421 350.5096 423.2668 428.6294 459.4670 526.3955 546.3843 556.7000 559.6282 567.2615 617.2500 626.8361 671.9506 705.0226 729.4379 749.0174 772.0449 782.1038 805.4371 811.5379 826.6015 856.1630 902.0642 932.3527 949.2873 970.0287 1000.5613 1041.0733 1052.7635 1088.9582 1102.2832 1113.4314 1133.1560 1137.9668 1148.8201 1159.6119 1214.3828 1235.0373 1240.4560 1268.1616 1287.1353 1295.2825 1324.1029 1358.8142 1364.6807 1399.8142 1423.0004 1427.3513 1445.1786 1453.4626 1463.8420 1471.4158 1473.7116 1486.3299 1564.7687 1586.9612 1630.2533 1643.5673 2993.6656 3003.5969 3005.8453 3052.5294 3075.6524 3107.6739 3148.1362 3151.8275 3173.5083 3188.9252 3225.2539 3606.6847
redmass: 6.6726 5.9640 7.6174 2.5200 6.3122 1.0888 5.8959 4.4318 3.1677 3.7916 5.7428 4.1278 5.1298 5.0721 9.2009 6.2784 3.6605 3.5283 4.4540 5.2811 1.5227 3.6666 3.8590 2.1671 5.6687 4.0349 5.4810 5.5518 5.7063 3.2481 4.0466 1.8288 4.6515 1.6010 1.5723 5.0238 5.4140 1.4980 5.8717 1.3230 2.0695 2.4643 3.3405 1.8443 2.6447 1.2680 1.4474 2.1783 1.4457 1.4857 7.9149 2.0509 1.3953 1.3984 1.5044 2.1807 1.9730 1.6182 9.6089 4.3567 1.1926 2.4372 1.0870 1.0500 1.0508 1.1849 3.8001 5.8238 6.6474 6.6733 7.1583 8.9767 1.0647 1.0600 1.0320 1.0961 1.0991 1.1046 1.0907 1.1048 1.0924 1.0948 1.0989 1.0811
irintensity: 2.6770 1.5084 0.4935 0.0315 0.9684 0.1699 0.1801 0.6622 1.4206 10.1410 2.0100 5.2833 18.3407 3.4874 1.2079 6.2319 2.3356 10.6948 2.0897 0.7630 76.3101 3.7119 10.5615 29.3134 13.1938 2.5259 4.0959 32.2252 10.3135 11.2173 0.6286 1.4787 2.1865 56.5365 20.3164 6.3475 2.5879 21.2427 16.0511 1.1564 2.9883 28.1996 14.8290 56.5949 6.7593 0.7335 66.4728 126.4464 11.5308 87.3955 441.5313 5.7296 12.2790 28.1815 34.9067 38.0888 1.4387 32.6454 145.0896 68.0871 24.6331 2.6583 18.2669 14.3612 10.9810 14.5354 10.9905 6.0813 0.6161 12.0888 37.7452 170.4139 6.8905 20.1506 31.9719 0.6716 15.7992 26.0869 9.5952 14.7888 1.2265 4.4505 0.7977 86.0189
temp: 298.150 k
press: 1.00000 atm
elementType: 8 8 8 8 7 7 6 6 6 6 6 6 6 6 6 6 6 6 1 1 1 1 1 1 1 1 1 1 1 1
symmnumber: 1
zpe: 593062.5 jmol-1
zpe.correction: 0.225886 hartree
zpe.thermalcorrener: 0.242547 hartree
zpe.thermalcorrenthalpy: 0.243491 hartree
zpe.thermalcorrgfe: 0.178140 hartree
zpe.sumelectzpe: -873.506657 hartree
zpe.sumelectthermal: -873.489996 hartree
zpe.sumelectthermalent: -873.489052 hartree
zpe.sumelectthermalfe: -873.554403 hartree
dipole: -1.8492 6.8771 -2.1074
dipole: 7.4267
quadrupole: -104.0702 -97.6245 -107.8800
quadrupole: 28.6210 3.6827 -3.0763
quadrupole: -0.8786 5.5671 -4.6885 28.6210 3.6827 -3.0763
hfenergy: -873.732543 hartree
pointgroup: C01 [X(C12H12N2O4)]
dipole: 0.8327068 2.7533923 0.5127161 debye
polarizability: 207.1637473|15.3342786|199.7877391|-21.1213472|-7.8154112|89.7625089 unknown
InChI: InChI=1S/C12H12N2O4/c1-18-12(15)5-2-8-7-13-11-4-3-9(14(16)17)6-10(8)11/h3-4,6-7,13H,2,5H2,1H3
charge 0 multiplicity 1
30 atoms
O  4.280328 -1.316687 0.921456
O  4.555012 -0.06137 -1.02138
O  -4.129038 -2.453949 0.504569
O  -2.024027 -3.105224 -0.082554
N  -1.076765 3.113943 0.008018
N  -2.899053 -2.193653 0.198011
C  0.512241 1.538903 -0.495951
C  -0.744798 0.868014 -0.193331
C  1.821647 0.889274 -0.867644
C  -1.721395 1.886181 0.119929
C  0.264748 2.903008 -0.3645
C  2.489082 0.164659 0.329688
C  -1.135582 -0.48907 -0.169696
C  -3.060025 1.576492 0.457291
C  -2.472315 -0.780003 0.167639
C  -3.434277 0.225075 0.481381
C  3.860231 -0.385129 -0.030619
C  5.627647 -1.900092 0.701956
H  1.66856 0.158384 -1.684809
H  2.527083 1.641812 -1.26168
H  0.942411 3.742008 -0.512283
H  1.86301 -0.659085 0.715489
H  2.617053 0.869506 1.174716
H  -1.507659 4.023613 0.159783
H  -0.451003 -1.307989 -0.406789
H  -3.788557 2.359221 0.692256
H  -4.451534 -0.083182 0.734032
H  5.659614 -2.431913 -0.263604
H  5.772296 -2.593183 1.54209
H  6.392867 -1.105667 0.703136
