program: Gaussian 09
title: 000248192
version: EM64L-G09RevD.01
frameworkgroup: C1[X(C4H2Br2N2O2)]
method: RPBEPBE
basis: SDD
operation: Freq
keyword: #p
keyword: freq=noraman
keyword: PBEPBE/SDD
title: #p freq=noraman PBEPBE/SDD
converged: NO YES NO YES
title: Mulliken charges:
elementType: Br Br O O N N C C C C H H
charge: 0.142742 0.142742 -0.237755 -0.237754 -0.320673 -0.320672 -0.215763 -0.215764 0.276866 0.276866 0.354583 0.354583
chargesum: 0.00000
title: Mulliken charges with hydrogens summed into heavy atoms:
elementType: Br Br O O N N C C C C
charge: 0.142742 0.142742 -0.237755 -0.237754 0.033910 0.033910 -0.215763 -0.215764 0.276866 0.276866
polarizability: 1.39490962e+02 -1.14835865e-05 1.17359298e+02 2.55269792e-03 8.73072585e-03 3.48202725e+01
1716.lowfreq: -2.2089 -0.0005 -0.0003 0.0002 1.4984 7.0041 53.6578 94.1079 128.8635
frequency: 53.6453 94.1067 128.8635 194.0862 209.3977 219.3137 271.3723 280.1741 314.8711 427.5540 485.2865 490.6155 541.6944 555.1507 676.4543 686.1782 711.0466 829.1745 879.6927 1029.9969 1104.1116 1258.3177 1305.2729 1380.5135 1455.6758 1528.5556 1614.5667 1632.0442 3545.5312 3554.7375
redmass: 14.5749 10.3907 59.6046 21.2141 9.5496 7.1731 18.5741 20.2315 1.3517 11.0922 3.7313 12.6995 5.7762 1.2264 9.9301 8.3572 11.5224 9.3071 9.8796 5.9854 3.4021 4.4435 11.2800 1.4147 1.9236 12.1228 5.4047 7.5798 1.0798 1.0799
irintensity: 0.0000 11.8001 0.1707 1.8589 0.0002 7.3680 0.0011 0.7533 0.0001 17.5582 0.0003 19.1357 1.3108 222.6079 7.2948 78.6594 0.0000 18.8465 63.2191 153.8474 72.4999 7.6487 17.3492 0.0007 12.6920 96.5254 625.3697 42.6572 14.7242 166.3477
temp: 298.150 k
press: 1.00000 atm
elementType: 35 35 8 8 7 7 6 6 6 6 1 1
symmnumber: 1
zpe: 164235.3 jmol-1
zpe.correction: 0.062554 hartree
zpe.thermalcorrener: 0.072307 hartree
zpe.thermalcorrenthalpy: 0.073251 hartree
zpe.thermalcorrgfe: 0.025104 hartree
zpe.sumelectzpe: -439.732090 hartree
zpe.sumelectthermal: -439.722337 hartree
zpe.sumelectthermalent: -439.721393 hartree
zpe.sumelectthermalfe: -439.769540 hartree
dipole: 0.0000 3.1817 0.0007
dipole: 3.1817
quadrupole: -96.4129 -50.3455 -75.5236
quadrupole: 0.0000 -0.0029 -0.0010
quadrupole: -22.3189 23.7485 -1.4296 0.0000 -0.0029 -0.0010
hfenergy: -439.7946442 hartree
pointgroup: C01 [X(C4H2Br2N2O2)]
dipole: 0.0000696 -1.2517733 0.0002868 debye
dipolederiv: -0.2026772 -0.2907776 0.0000491 -0.4362939 -0.3377412 0.0001245 0.0001286 0.000173 0.0672776 -0.2027558 0.290792 -0.0000329 0.4363087 -0.3376636 0.0000952 -0.0001416 0.0001928 0.0672771 -1.27373 0.0945668 -0.0005322 0.1906956 -0.4939432 -0.0000241 0.001039 -0.0000617 -0.3472848 -1.2736997 -0.0946517 0.000424 -0.1907806 -0.4939739 0.0000034 -0.0008942 -0.0000625 -0.347285 -0.2975541 0.4771461 0.0000954 -0.3769349 -0.5350565 0.0000007 -0.000506 -0.00092 -0.2957212 -0.297544 -0.4771204 -0.000344 0.3769616 -0.5350686 0.0004525 0.0003376 0.0007256 -0.2957202 0.0954868 0.8710159 -0.0002319 1.033974 0.2901494 -0.0001508 -0.0002996 0.0000898 -0.0871902 0.0956929 -0.8710377 0.0002578 -1.0339953 0.289944 -0.0001335 0.0002768 -0.0000097 -0.0871899 1.5342928 -0.2681133 0.0005388 -0.083832 0.8231688 0.0000388 -0.0004481 0.0000942 0.2825505 1.5342565 0.2681919 -0.0003144 0.0839089 0.8232072 -0.0002381 0.000489 -0.0000634 0.2825506 0.1441217 -0.0551214 0.0000237 -0.0501303 0.2534829 -0.0000292 0.0000006 0.000174 0.3803679 0.1441101 0.0551094 0.0000667 0.0501184 0.2534947 -0.0001393 0.0000179 -0.0003321 0.3803675 unknown
polarizability: 139.4909622|0.0011927|117.3592984|-0.0025522|-0.0087309|34.8202725 unknown
InChI: InChI=1S/C4H2Br2N2O2/c5-1-2(6)4(10)8-7-3(1)9/h7-8H
charge 0 multiplicity 1
12 atoms
Br 1.753623 2.287759 -0.000447
Br -1.753885 2.28757 -0.000398
O  2.748397 -0.665763 -0.000564
O  -2.74834 -0.666062 -0.000224
N  0.701612 -1.734681 -0.000277
N  -0.701439 -1.734757 0.000229
C  0.688128 0.684119 0.000238
C  -0.688217 0.684044 0.000311
C  1.489198 -0.582778 0.000732
C  -1.48915 -0.58294 0.00088
H  1.17463 -2.641441 -0.000573
H  -1.174358 -2.641568 -0.000707
