program: Gaussian 09
title: 000248193
version: EM64L-G09RevD.01
frameworkgroup: C1[X(C4H2I2N2O2)]
method: RPBEPBE
basis: SDD
operation: Freq
keyword: #p
keyword: freq=noraman
keyword: PBEPBE/SDD
title: #p freq=noraman PBEPBE/SDD
converged: NO YES NO NO
title: Mulliken charges:
elementType: I I O O N N C C C C H H
charge: 0.243478 0.243478 -0.241438 -0.241438 -0.317328 -0.317329 -0.332196 -0.332196 0.293841 0.293841 0.353643 0.353643
chargesum: 0.00000
title: Mulliken charges with hydrogens summed into heavy atoms:
elementType: I I O O N N C C C C
charge: 0.243478 0.243478 -0.241438 -0.241438 0.036315 0.036314 -0.332196 -0.332196 0.293841 0.293841
polarizability: 1.60617245e+02 -8.39326735e-03 1.38946680e+02 7.28431432e-03 1.48599983e-02 3.61674243e+01
1716.lowfreq: -0.0008 -0.0007 -0.0007 3.4179 7.4048 8.0065 45.8446 91.4850 98.5356
frequency: 45.8259 91.4834 98.5356 167.4743 209.2683 210.3027 234.5217 247.8907 313.9468 419.2365 475.2022 483.8208 533.5094 553.0011 660.9940 684.9878 708.8979 819.9799 852.4277 1008.5561 1099.3107 1252.4475 1308.1791 1381.0810 1455.5528 1506.5846 1610.6797 1624.3641 3545.4340 3554.7206
redmass: 13.7788 10.0759 85.0988 20.1864 9.6695 7.2811 16.4095 17.7717 1.3880 11.1379 3.4365 12.8980 5.9212 1.2334 10.0305 7.8535 11.3797 9.1526 10.0812 6.1365 3.4195 4.2888 10.3526 1.4259 1.9361 11.8245 5.2926 7.5229 1.0797 1.0799
irintensity: 0.0000 12.6001 0.3875 1.7765 0.0000 9.5771 0.5588 0.5237 0.0000 21.7677 0.0001 14.6658 2.6417 209.9249 7.6334 89.8983 0.0000 17.8123 41.4622 181.2078 102.4219 14.6887 20.9330 0.1008 16.5386 113.7332 586.0505 61.2216 14.6771 166.7473
temp: 298.150 k
press: 1.00000 atm
elementType: 53 53 8 8 7 7 6 6 6 6 1 1
symmnumber: 1
zpe: 162442.2 jmol-1
zpe.correction: 0.061871 hartree
zpe.thermalcorrener: 0.071905 hartree
zpe.thermalcorrenthalpy: 0.072849 hartree
zpe.thermalcorrgfe: 0.022905 hartree
zpe.sumelectzpe: -435.828029 hartree
zpe.sumelectthermal: -435.817995 hartree
zpe.sumelectthermalent: -435.817051 hartree
zpe.sumelectthermalfe: -435.866995 hartree
dipole: 0.0000 2.4638 0.0004
dipole: 2.4638
quadrupole: -105.6462 -57.1732 -86.7808
quadrupole: 0.0000 0.0029 0.0010
quadrupole: -22.4462 26.0269 -3.5807 0.0000 0.0029 0.0010
hfenergy: -435.8898999 hartree
pointgroup: C01 [X(C4H2I2N2O2)]
dipole: -0.0000064 0.9693396 -0.0001497 debye
dipolederiv: -0.1300708 -0.2984829 0.0000573 -0.3941285 -0.204788 -0.000009 -0.0000491 0.0001105 0.1079925 -0.1302457 0.298358 -0.0000735 0.3941171 -0.2050453 0.0001434 -0.0001908 0.0001796 0.1079899 -1.2657045 0.1516958 -0.000194 0.2061423 -0.5349818 -0.0000139 0.0007488 -0.0001481 -0.349607 -1.2657814 -0.1514739 0.0002496 -0.2062458 -0.5350215 -0.0000017 -0.0002719 -0.0000621 -0.3496088 -0.2708739 0.5190132 0.0000094 -0.3621537 -0.5611996 0.0002074 -0.0002161 -0.0004191 -0.294275 -0.2710309 -0.519044 -0.0001114 0.3619377 -0.5612613 0.000087 0.0000648 0.0003476 -0.2942794 0.0545229 0.9389907 -0.0000915 1.1436789 0.170912 0.0001038 0.0000478 0.0000264 -0.1347674 0.0544766 -0.9389088 0.0002496 -1.1436378 0.1710373 -0.0002787 0.000343 -0.0001695 -0.1347885 1.4698344 -0.3695004 0.0000873 -0.1543454 0.880896 -0.0001035 -0.0006018 0.0002697 0.2912915 1.4700675 0.3693298 -0.0002501 0.1542886 0.8811241 -0.0000731 0.0000674 -0.0000181 0.2913069 0.142324 -0.0579676 0.0000282 -0.0503166 0.2491514 -0.0000302 0.0000428 -0.0000369 0.3793733 0.1424817 0.0579901 0.0000391 0.050663 0.2491764 -0.0000316 0.0000152 -0.0000798 0.379372 unknown
polarizability: 160.6172447|0.008611|138.9466806|0.0072845|-0.0148599|36.1674243 unknown
InChI: InChI=1S/C4H2I2N2O2/c5-1-2(6)4(10)8-7-3(1)9/h7-8H
charge 0 multiplicity 1
12 atoms
I  -1.897861 -2.40525 0.000008
I  1.897916 -2.405213 0.000466
O  -2.746145 0.701993 0.000479
O  2.74614 0.702047 -0.000119
N  -0.700768 1.764119 0.000081
N  0.700742 1.764133 -0.00037
C  -0.689495 -0.660529 -0.000212
C  0.689517 -0.660516 -0.000152
C  -1.486288 0.612193 -0.000352
C  1.486285 0.612222 -0.000577
H  -1.173937 2.670738 0.000544
H  1.173894 2.670762 -0.000196
