program: Gaussian 09
title: 000248202
version: EM64L-G09RevD.01
frameworkgroup: C1[X(C16H33N3O3)]
method: RPBEPBE
basis: SDD
operation: Freq
keyword: #p
keyword: freq=noraman
keyword: PBEPBE/SDD
title: #p freq=noraman PBEPBE/SDD
converged: NO YES NO NO
title: Mulliken charges:
elementType: O O O N N N C C C C C C C C C C C C C C C C H H H H H H H H H H H H H H H H H H H H H H H H H H H H H H H H H
charge: -0.462754 -0.312416 -0.308566 -0.101011 -0.145928 -0.182323 -0.341245 -0.347397 -0.386675 -0.394608 -0.388807 -0.056659 -0.393393 0.303152 -0.304389 -0.324650 -0.679390 -0.670281 -0.284696 -0.351041 -0.346200 -0.688558 0.209479 0.192690 0.192355 0.215287 0.218433 0.210902 0.254194 0.212666 0.218048 0.251952 0.177063 0.228741 0.205334 0.213446 0.197872 0.207685 0.198280 0.354310 0.213712 0.209636 0.228455 0.212397 0.218715 0.225041 0.211985 0.229092 0.227890 0.197197 0.190144 0.203239 0.216482 0.209631 0.215485
chargesum: 0.00000
title: Mulliken charges with hydrogens summed into heavy atoms:
elementType: O O O N N N C C C C C C C C C C C C C C C C
charge: -0.108444 -0.312416 -0.308566 -0.101011 -0.145928 -0.182323 0.060925 0.060244 0.042659 0.072252 0.081193 0.120403 0.040683 0.303152 0.106929 0.081315 -0.027586 -0.014128 0.156381 0.074045 0.047182 -0.046960
polarizability: 2.69999782e+02 -2.70030108e+00 1.88843197e+02 -1.16543394e+00 -2.68725085e+00 1.70225794e+02
1716.lowfreq: -5.6478 -3.1942 -0.0011 0.0005 0.0010 5.2445 9.1652 16.4081 17.4442
frequency: 5.8516 15.5273 16.7419 31.7228 37.2201 55.1660 60.0395 63.9864 73.5751 82.3396 93.5111 99.4597 112.0076 143.3687 162.7259 174.0522 192.5066 209.5428 224.9873 228.9482 244.6169 261.3591 282.1068 284.0979 304.7221 308.1173 322.4966 357.8976 380.0532 396.2287 403.9106 423.2426 441.5074 448.1227 470.6373 486.8897 539.1522 558.4742 577.8862 629.2693 691.3322 729.5202 735.7165 744.3167 749.2931 772.0884 795.6562 799.1470 805.7874 838.1486 839.8640 885.4951 893.0008 903.0652 926.0550 938.2691 955.0969 984.7945 993.1736 999.5052 1033.8415 1039.4193 1049.6675 1059.4014 1060.9947 1063.6715 1072.7045 1076.0061 1080.5339 1087.8198 1098.1888 1109.4044 1116.6557 1137.3932 1142.0169 1163.1236 1165.9632 1196.9442 1198.7799 1207.7668 1218.0770 1228.1176 1239.1246 1256.1422 1271.0111 1277.2021 1278.5623 1286.4789 1288.4284 1288.7850 1290.4183 1292.3767 1301.5647 1329.4331 1339.7591 1344.7368 1346.5362 1357.5864 1359.8557 1361.3799 1369.4245 1371.5584 1385.4206 1390.8474 1391.0566 1391.8520 1410.7013 1417.2755 1453.3603 1453.8315 1456.2696 1460.1910 1463.4485 1466.5031 1467.8127 1469.1247 1470.0490 1474.0090 1475.0155 1476.8152 1477.2936 1478.5340 1484.6971 1488.2883 1490.9693 1640.4771 2856.4921 2864.9217 2887.7027 2894.9523 2896.5001 2909.2870 2963.2751 2967.8578 2972.5153 2975.4277 2977.1590 2985.9051 2986.9149 2988.9774 3012.9922 3018.4426 3029.8418 3032.2047 3040.4856 3042.3201 3047.2888 3050.1428 3058.0893 3072.7088 3075.4110 3079.8634 3082.3270 3090.8086 3092.1341 3093.7160 3095.4185 3118.1839 3183.9660
redmass: 3.9762 3.3940 4.1804 4.2637 3.4380 1.9036 2.4807 4.0815 2.8303 2.0619 3.9668 3.6643 3.0189 2.4984 2.6282 2.5883 3.4254 1.3388 3.9613 1.1361 1.5379 2.2554 2.1783 2.2847 3.7061 2.6065 2.3105 3.2355 2.7857 2.3189 2.8251 2.9810 2.7955 3.4157 2.6992 2.2262 5.3955 3.4136 3.8072 2.2617 11.2148 1.1236 2.2497 1.3045 2.2889 3.2676 1.1721 1.2147 1.2873 2.2672 1.7302 2.1852 2.4087 2.0310 1.9673 1.1953 2.0837 2.3619 3.6707 2.5609 3.3893 2.3656 1.8274 2.6410 2.6648 2.6262 2.0133 2.4111 2.3750 2.2240 2.1136 2.2324 2.4868 2.0970 2.3635 1.7489 2.0876 1.1205 2.2546 2.3792 1.5998 1.3360 1.5738 1.7780 1.2867 1.3992 1.1459 1.2101 1.0771 1.3431 1.2209 1.1494 1.2337 1.2863 1.2761 1.3829 1.3357 1.4065 1.3522 1.3240 1.3911 1.3839 1.4510 1.2262 1.2212 1.2279 2.4073 1.5851 1.1069 1.0937 1.0852 1.0795 1.0959 1.0538 1.0977 1.0587 1.0713 1.0697 1.0841 1.0573 1.0493 1.0530 1.0680 1.0838 1.0722 9.2070 1.0713 1.0697 1.0712 1.0711 1.0700 1.0809 1.0655 1.0585 1.0693 1.0367 1.0677 1.0358 1.0358 1.0603 1.0987 1.0579 1.0889 1.0916 1.0893 1.0884 1.0894 1.1026 1.0964 1.1007 1.0998 1.0984 1.0983 1.1007 1.1004 1.0949 1.1085 1.0927 1.0631
irintensity: 0.1674 0.2326 0.6141 0.6381 0.7657 0.1900 0.7616 1.0559 0.2740 1.4490 2.2338 1.2252 2.4690 1.9085 1.5372 0.7041 1.8984 0.4399 2.1823 0.5412 3.2708 2.9103 1.9694 7.0360 8.4231 2.0025 4.4151 21.5131 7.8752 1.0188 3.8954 1.9037 2.6563 10.4497 0.2377 1.1664 5.0016 3.8776 0.8557 1.1204 16.7930 95.8093 20.0531 5.1253 12.2885 7.8117 9.2765 4.7391 2.6079 2.3261 1.0505 9.5904 17.2945 0.0949 1.9658 0.5122 22.4587 40.1181 55.1602 91.8287 5.8866 44.8575 23.4293 23.3148 115.5790 87.6113 18.9504 9.0578 1.9403 4.0769 23.4430 59.0098 3.5569 14.2417 61.1219 23.8557 25.3980 6.0172 29.7227 63.0682 220.1913 11.6311 49.7893 32.2641 11.0800 17.0368 7.1730 26.7807 1.8019 32.2001 13.9676 3.1282 16.9413 12.0987 15.5146 7.1691 1.8245 4.1188 19.3498 1.4977 11.4198 9.2626 6.7352 23.5695 9.7864 20.7620 129.3189 54.4674 48.7233 16.6098 5.0645 18.9052 9.5290 6.6335 13.5413 5.8955 0.7837 6.4963 8.8934 5.5152 10.6463 5.9732 9.8360 18.9809 19.5600 446.8925 44.6491 97.6390 27.0612 103.3810 133.7500 57.7632 56.9050 31.5538 29.3697 38.5870 69.5596 29.9227 23.1180 23.9339 9.4500 59.8024 12.0405 5.5068 58.3770 18.0052 39.1548 7.8145 41.2202 60.1951 55.1732 41.5642 55.9281 48.5041 38.1592 4.5244 40.2258 4.9365 215.9203
temp: 298.150 k
press: 1.00000 atm
elementType: 8 8 8 7 7 7 6 6 6 6 6 6 6 6 6 6 6 6 6 6 6 6 1 1 1 1 1 1 1 1 1 1 1 1 1 1 1 1 1 1 1 1 1 1 1 1 1 1 1 1 1 1 1 1 1
symmnumber: 1
zpe: 1271141.9 jmol-1
zpe.correction: 0.484152 hartree
zpe.thermalcorrener: 0.510333 hartree
zpe.thermalcorrenthalpy: 0.511277 hartree
zpe.thermalcorrgfe: 0.422495 hartree
zpe.sumelectzpe: -1017.593404 hartree
zpe.sumelectthermal: -1017.567224 hartree
zpe.sumelectthermalent: -1017.566280 hartree
zpe.sumelectthermalfe: -1017.655062 hartree
dipole: 1.9970 1.7575 -2.1993
dipole: 3.4517
quadrupole: -126.0954 -135.2443 -144.8468
quadrupole: -10.8062 -15.4692 -3.9988
quadrupole: 9.3001 0.1512 -9.4513 -10.8062 -15.4692 -3.9988
hfenergy: -1018.0775565 hartree
pointgroup: C01 [X(C16H33N3O3)]
dipole: -0.7013653 0.6941402 0.9329451 debye
polarizability: 269.6428993|-0.87931|188.5339786|-6.6296525|3.4895317|170.891895 unknown
InChI: InChI=1S/C16H33N3O3/c1-4-7-12-22-16(21)19-10-8-18(9-11-19)14-15(20)13-17(5-2)6-3/h15,20H,4-14H2,1-3H3
charge 0 multiplicity 1
55 atoms
O  -3.974849 0.805693 -1.836568
O  3.95484 0.612211 0.878933
O  3.96363 -1.73371 0.653974
N  -0.716771 -0.318774 -0.330122
N  1.955901 -0.518131 0.697608
N  -4.984843 0.826181 0.637848
C  0.18049 0.865764 -0.324069
C  0.079476 -1.557653 -0.531793
C  -1.835239 -0.191825 -1.300166
C  1.219351 0.755742 0.809444
C  1.109334 -1.723167 0.600729
C  -2.960441 0.721655 -0.785329
C  -3.645161 0.177014 0.499644
C  3.328124 -0.644804 0.733153
C  -4.905936 2.135424 1.35281
C  -6.032326 -0.08356 1.188604
C  -6.064076 3.088266 1.003557
C  -6.519959 -1.124024 0.163351
C  5.44288 0.580362 0.866638
C  5.993026 0.65429 -0.563927
C  7.539226 0.705859 -0.579498
C  8.109862 0.800571 -2.011128
H  -0.420125 1.779425 -0.168975
H  0.715092 0.971762 -1.302735
H  0.61672 -1.549238 -1.514158
H  -0.605708 -2.425001 -0.525763
H  -1.496251 0.191161 -2.292943
H  -2.269286 -1.194438 -1.473692
H  1.935378 1.588656 0.765703
H  0.691213 0.787587 1.784641
H  0.572363 -1.870805 1.559773
H  1.764518 -2.590348 0.420201
H  -2.556658 1.740049 -0.580418
H  -2.997278 0.329137 1.3881
H  -3.796045 -0.910341 0.37731
H  -3.953629 2.613962 1.058158
H  -4.85654 1.979776 2.457918
H  -6.890874 0.541212 1.493949
H  -5.6672 -0.596757 2.110764
H  -4.819319 0.966342 -1.29983
H  -5.940062 4.050829 1.533319
H  -7.046318 2.673828 1.293675
H  -6.083694 3.286008 -0.082556
H  -7.303148 -1.763008 0.61151
H  -5.702835 -1.783795 -0.178343
H  -6.941153 -0.622259 -0.725377
H  5.729044 1.466265 1.459157
H  5.782307 -0.342074 1.371512
H  5.644642 -0.231252 -1.128517
H  5.584664 1.552279 -1.067864
H  7.887646 1.575234 0.015274
H  7.941672 -0.198541 -0.080277
H  9.214672 0.83522 -2.003206
H  7.745766 1.710876 -2.523606
H  7.802285 -0.071833 -2.617298
