program: Gaussian 09
title: 000248150
version: EM64L-G09RevD.01
frameworkgroup: C1[X(C15H16N2O)]
method: RPBEPBE
basis: SDD
operation: Freq
keyword: #p
keyword: freq=noraman
keyword: PBEPBE/SDD
title: #p freq=noraman PBEPBE/SDD
converged: YES YES NO NO
title: Mulliken charges:
elementType: O N N C C C C C C C C C C C C C C C H H H H H H H H H H H H H H H H
charge: -0.288279 -0.283820 -0.405537 -0.496753 0.422682 0.302031 0.447177 0.134931 -0.360904 -0.356654 -0.413653 -0.381166 -0.394173 -0.377892 -0.222328 -0.228359 -0.803277 -0.235127 0.221568 0.230780 0.316832 0.223672 0.271790 0.232524 0.280482 0.319992 0.233281 0.234951 0.224913 0.226826 0.228714 0.226807 0.240420 0.227547
chargesum: 0.00000
title: Mulliken charges with hydrogens summed into heavy atoms:
elementType: O N N C C C C C C C C C C C C C C C
charge: -0.288279 0.033012 -0.085544 -0.044406 0.422682 0.302031 0.447177 0.134931 -0.137232 -0.084864 -0.181129 -0.100684 -0.160892 -0.142940 0.002585 -0.001533 -0.107336 -0.007580
polarizability: 2.84806558e+02 -1.34015327e+00 1.74401715e+02 -1.17403871e+01 4.08834026e+00 8.60407612e+01
1716.lowfreq: -8.9403 -5.0455 0.0007 0.0009 0.0010 3.2247 11.0820 16.3321 29.2307
frequency: 5.0976 15.5946 29.1632 32.6647 49.2431 86.6483 96.4889 107.5874 168.3583 231.8688 262.7742 276.7503 315.2225 336.8467 348.7560 388.2578 405.0765 405.5417 459.6421 492.5226 507.6145 525.7106 582.2127 615.0171 618.7254 634.1910 690.0783 691.5551 706.6239 743.3792 763.4538 784.6959 823.1294 836.4271 860.2509 861.0137 861.5577 924.9493 960.4058 976.3491 983.2347 985.8551 989.3738 992.8335 999.6844 1010.2632 1026.9326 1038.1751 1048.0161 1059.9442 1093.2582 1124.3174 1161.3466 1172.2267 1188.4219 1193.6961 1201.4425 1219.8321 1224.7302 1276.8101 1308.8146 1325.5893 1337.5101 1369.3649 1384.9796 1397.4265 1404.1922 1432.5661 1440.3875 1469.6197 1473.3963 1481.3889 1485.6443 1488.3905 1506.2042 1560.6848 1593.0644 1594.7710 1615.1361 1621.4738 2972.6168 2977.1534 3041.7557 3059.0952 3088.5828 3117.1149 3118.0542 3121.1917 3127.9705 3133.2519 3140.8050 3145.5409 3161.0376 3162.2637 3377.1285 3559.8891
redmass: 1.0704 3.9922 4.8952 3.6675 4.6437 5.1088 5.2098 4.2344 4.2308 4.4582 3.9905 3.9834 3.4660 3.3880 3.0352 3.8446 2.8486 2.8555 4.6289 3.2457 3.3406 1.2957 4.5384 5.3815 5.2266 6.6678 2.1130 3.4325 1.9201 2.7903 1.6397 5.1520 3.8543 1.6593 2.7681 1.3601 1.5328 1.3761 1.3541 1.7595 1.3813 1.4139 5.9570 1.3823 1.3233 3.3209 2.2273 4.1607 1.5838 2.6045 1.6571 1.3142 3.1754 1.0576 1.1228 1.1276 1.2662 2.5784 3.0783 2.4200 1.2977 1.2765 1.3107 4.6227 8.0619 1.2210 3.3215 1.7471 2.1823 1.1036 1.0561 1.2701 1.6516 1.2236 2.6482 5.7495 6.3118 6.3880 6.0673 6.3088 1.0626 1.0388 1.1007 1.0947 1.0999 1.0870 1.0866 1.0875 1.0893 1.0918 1.0965 1.0961 1.0955 1.1015 1.0742 1.0791
irintensity: 0.6605 0.4592 0.9376 0.0169 1.7029 3.2749 3.3057 1.2168 1.6014 4.3148 13.8680 1.7349 5.5920 3.5169 8.2926 0.8500 0.2420 0.2136 8.0371 2.1153 3.6171 100.4888 15.9504 5.9357 7.1196 0.7504 60.6235 58.4262 52.0334 21.4298 23.0687 3.1983 13.7753 18.9625 4.7408 8.2063 1.9375 2.7486 1.4365 2.1107 0.3462 1.7104 0.0693 1.1174 1.1505 14.5619 12.3347 20.0684 21.6861 8.0148 5.1942 15.4358 1.3337 0.0641 1.7782 17.5378 2.7283 2.2773 2.2124 156.4340 1.6823 4.0374 0.2153 2.5644 0.6161 11.8367 8.0362 198.0167 13.0907 15.7451 12.1360 12.2698 21.7668 21.6257 15.4275 66.1889 19.0205 29.3432 3.9029 43.2279 37.1138 30.5322 29.9264 21.6668 16.4751 15.0007 1.2956 1.8345 19.1890 9.9875 18.6244 37.2965 5.1786 31.0312 1.7294 26.5085
temp: 298.150 k
press: 1.00000 atm
elementType: 8 7 7 6 6 6 6 6 6 6 6 6 6 6 6 6 6 6 1 1 1 1 1 1 1 1 1 1 1 1 1 1 1 1
symmnumber: 1
zpe: 724134.9 jmol-1
zpe.correction: 0.275808 hartree
zpe.thermalcorrener: 0.292656 hartree
zpe.thermalcorrenthalpy: 0.293600 hartree
zpe.thermalcorrgfe: 0.225930 hartree
zpe.sumelectzpe: -764.620376 hartree
zpe.sumelectthermal: -764.603529 hartree
zpe.sumelectthermalent: -764.602585 hartree
zpe.sumelectthermalfe: -764.670254 hartree
dipole: 2.7221 -1.9266 -0.0723
dipole: 3.3357
quadrupole: -79.9621 -98.0972 -111.7730
quadrupole: -1.8170 -1.0544 2.3987
quadrupole: 16.6487 -1.4864 -15.1623 -1.8170 -1.0544 2.3987
hfenergy: -764.8961846 hartree
pointgroup: C01 [X(C15H16N2O1)]
dipole: 1.121784 -0.6745758 -0.0941296 debye
polarizability: 284.979688|7.1248351|171.9251277|-5.2730087|16.0145551|88.3442187 unknown
InChI: InChI=1S/C15H16N2O/c1-12-7-9-14(10-8-12)15(18)17-16-11-13-5-3-2-4-6-13/h2-10,16-17H,11H2,1H3
charge 0 multiplicity 1
34 atoms
O  0.075668 1.483433 0.290442
N  -1.207151 -0.967178 0.666128
N  0.205555 -0.816353 0.554361
C  -1.903764 -0.886891 -0.674688
C  -3.314379 -0.356705 -0.487081
C  2.291114 0.460656 0.251714
C  5.140711 0.654779 0.079242
C  0.793042 0.431372 0.353276
C  3.069505 -0.665415 -0.123837
C  2.948846 1.686767 0.523318
C  -4.441042 -1.214126 -0.525742
C  -3.50833 1.029868 -0.245381
C  4.474165 -0.565455 -0.205542
C  4.351791 1.778338 0.443441
C  -5.743868 -0.697589 -0.336625
C  -4.808513 1.546162 -0.052718
C  6.649949 0.765726 -0.037995
C  -5.930017 0.683962 -0.099871
H  -1.91604 -1.897158 -1.120979
H  -1.33924 -0.211371 -1.349404
H  -1.561999 -0.21033 1.276227
H  2.588788 -1.614244 -0.391063
H  2.336388 2.55388 0.791522
H  -4.296275 -2.286879 -0.70232
H  -2.633839 1.692732 -0.214329
H  0.758416 -1.643641 0.778409
H  5.062334 -1.441969 -0.502945
H  4.845635 2.732109 0.664819
H  -6.609054 -1.369319 -0.372426
H  -4.948774 2.617825 0.128578
H  7.057391 1.508329 0.670179
H  7.145303 -0.201766 0.155292
H  6.943795 1.088407 -1.055877
H  -6.93931 1.085645 0.045673
