program: Gaussian 09
title: 000248134
version: EM64L-G09RevD.01
frameworkgroup: C1[X(C12H14N2O2)]
method: RPBEPBE
basis: SDD
operation: Freq
keyword: #p
keyword: freq=noraman
keyword: PBEPBE/SDD
title: #p freq=noraman PBEPBE/SDD
converged: YES YES NO NO
title: Mulliken charges:
elementType: O O N N C C C C C C C C C C C C H H H H H H H H H H H H H H
charge: -0.268029 -0.253295 -0.411821 -0.718973 0.141476 0.296184 0.221029 -0.608486 -0.393109 -0.617194 -0.322696 0.534481 -0.431356 0.255367 -0.225675 -0.673554 0.253412 0.254132 0.298893 0.298854 0.219933 0.220989 0.209190 0.297952 0.298058 0.226806 0.227329 0.210655 0.229811 0.229638
chargesum: 0.00000
title: Mulliken charges with hydrogens summed into heavy atoms:
elementType: O O N N C C C C C C C C C C C C
charge: -0.268029 -0.253295 -0.112967 -0.122963 0.141476 0.296184 0.221029 -0.100942 -0.094216 -0.397261 -0.101707 0.534481 -0.222166 0.255367 0.228461 -0.003451
polarizability: 2.15491798e+02 -1.45775793e+01 1.68736954e+02 9.05123099e-01 8.19540255e-01 7.50340589e+01
1716.lowfreq: -10.8930 -3.3713 -0.0005 -0.0004 -0.0002 4.1647 13.4076 27.0213 54.6243
frequency: 12.4132 26.7965 54.5956 69.3664 126.2124 138.8327 152.5106 154.8182 206.8440 247.5209 263.8975 282.6881 303.4605 317.1928 340.3356 357.9230 385.0145 425.6836 445.2077 471.6863 500.5709 538.1420 592.6557 599.0278 644.5948 679.5122 725.7437 750.5291 756.2209 789.5421 798.7632 814.7629 831.9771 841.1632 846.8451 910.0080 916.4834 929.3832 946.8026 1023.2208 1031.5928 1045.5493 1094.5749 1105.1878 1115.8140 1136.3429 1146.6753 1196.1084 1232.1952 1238.1431 1249.4285 1250.6058 1296.8144 1328.4761 1347.1361 1362.8363 1397.6790 1400.9405 1432.2481 1437.8828 1463.5407 1468.4975 1474.0621 1487.0019 1498.3637 1568.4122 1598.7418 1635.9254 1643.1106 1649.7744 2961.8498 2995.5191 2999.4196 3007.9092 3066.0277 3092.2829 3106.7990 3116.2006 3118.9819 3143.0437 3252.6693 3575.0979 3620.3949 3716.5624
redmass: 3.6114 3.3467 3.7868 4.1345 2.7015 2.6381 4.5930 3.4620 5.6442 1.2338 1.1964 4.1991 5.3218 1.1349 3.6738 3.7234 3.5539 2.6519 5.0602 1.2695 4.9890 2.9833 2.5759 5.4330 3.4364 6.0517 4.7088 3.1599 6.2144 1.5284 1.0976 4.2516 1.3866 4.2802 1.7329 5.6139 1.3464 3.0904 2.3691 2.2475 1.7398 2.1570 1.5832 2.9015 2.3431 1.4669 1.2405 1.1149 2.8231 1.9104 1.1346 1.5220 2.5280 2.4839 1.6111 1.7210 4.0631 1.3282 2.6012 1.1679 1.0403 4.0613 1.0593 1.0703 5.0524 6.2352 5.8089 1.2098 8.4203 6.3429 1.0615 1.0358 1.0951 1.0581 1.1067 1.0986 1.1024 1.0878 1.0901 1.0968 1.0988 1.0446 1.0808 1.1041
irintensity: 0.1126 0.3784 0.3924 1.0164 3.8965 0.1084 2.9915 18.5742 3.9150 1.1928 297.0312 8.6393 20.0795 5.7112 0.4379 4.9335 8.5772 2.1008 2.2694 107.4384 0.7448 10.6517 11.5559 5.7681 12.2532 7.9891 3.1288 0.2549 0.7656 52.9550 4.8574 9.5891 0.7789 0.1207 68.0461 46.0846 0.0886 5.3312 4.0288 69.0671 5.1541 2.4412 210.6219 266.2660 102.3564 5.8538 20.4734 1.0174 2.2577 58.9557 0.0149 18.8506 7.2421 17.4979 62.4918 43.1911 15.6655 18.3756 15.2900 22.7425 11.9618 46.9259 6.3713 10.6030 76.1793 8.0611 44.1007 87.0382 222.0180 86.9192 32.0720 23.2602 6.9985 21.4455 9.7702 31.9006 45.6677 8.9070 28.5308 28.0581 5.5059 57.3059 57.6712 17.0806
temp: 298.150 k
press: 1.00000 atm
elementType: 8 8 7 7 6 6 6 6 6 6 6 6 6 6 6 6 1 1 1 1 1 1 1 1 1 1 1 1 1 1
symmnumber: 1
zpe: 629985.6 jmol-1
zpe.correction: 0.239949 hartree
zpe.thermalcorrener: 0.255759 hartree
zpe.thermalcorrenthalpy: 0.256703 hartree
zpe.thermalcorrgfe: 0.194717 hartree
zpe.sumelectzpe: -724.477293 hartree
zpe.sumelectthermal: -724.461483 hartree
zpe.sumelectthermalent: -724.460539 hartree
zpe.sumelectthermalfe: -724.522525 hartree
dipole: -0.2266 1.3500 -0.0396
dipole: 1.3694
quadrupole: -69.7192 -78.3178 -99.1182
quadrupole: 2.1212 0.0779 0.5862
quadrupole: 12.6659 4.0673 -16.7332 2.1212 0.0779 0.5862
hfenergy: -724.7172415 hartree
pointgroup: C01 [X(C12H14N2O2)]
dipole: -0.0435429 -0.5107576 -0.165877 debye
polarizability: 212.670165|17.1493534|160.1091299|6.5156781|31.2325005|86.4835159 unknown
InChI: InChI=1S/C12H14N2O2/c1-2-16-12(15)5-8-7-14-11-4-3-9(13)6-10(8)11/h3-4,6-7,14H,2,5,13H2,1H3
charge 0 multiplicity 1
30 atoms
O  3.688256 -0.409296 -0.095803
O  2.790966 1.631662 0.567279
N  -1.499654 2.073755 0.76427
N  -3.653962 -2.783609 -1.026871
C  -1.290765 -0.057665 -0.036856
C  0.038252 0.499694 0.154539
C  -2.237231 0.951841 0.353931
C  1.309906 -0.251144 -0.14493
C  -0.132155 1.798172 0.642368
C  -1.758275 -1.315017 -0.501914
C  -3.627476 0.725914 0.287497
C  -3.153822 -1.552461 -0.572266
C  -4.07554 -0.525039 -0.175108
C  2.619471 0.460115 0.159276
C  5.056176 0.146022 0.141395
C  6.045177 -0.969033 -0.182431
H  1.333509 -1.215103 0.403499
H  1.348419 -0.540484 -1.216512
H  0.628978 2.528086 0.903105
H  -1.891545 2.950046 1.099079
H  -1.053122 -2.098707 -0.806043
H  -4.350388 1.494265 0.584677
H  -5.152658 -0.724744 -0.235439
H  -3.024864 -3.52615 -1.314342
H  -4.653417 -2.951471 -1.076304
H  5.18876 1.032498 -0.505256
H  5.119391 0.477561 1.193729
H  7.078924 -0.611401 -0.023385
H  5.876754 -1.8454 0.466537
H  5.946437 -1.290706 -1.233319
