program: Gaussian 09
title: 000248183
version: EM64L-G09RevD.01
frameworkgroup: C1[X(C25H22N2S3)]
method: RPBEPBE
basis: SDD
operation: Freq
keyword: #p
keyword: freq=noraman
keyword: PBEPBE/SDD
title: #p freq=noraman PBEPBE/SDD
converged: YES YES NO NO
title: Mulliken charges:
elementType: S S S N N C C C C C C C C C C C C C C C C C C C C C C C C C H H H H H H H H H H H H H H H H H H H H H H
charge: 0.251086 0.246968 0.227420 -0.056256 -0.051531 -0.087052 -0.821636 -0.074520 0.493584 -0.829966 -0.340434 0.475763 -0.782908 0.469245 -0.358759 -0.391975 -0.343569 -0.379683 -0.370741 -0.376943 -0.378379 -0.218924 -0.218583 -0.219759 -0.219563 -0.221276 -0.222530 -0.235158 -0.232835 -0.236292 0.292723 0.284940 0.279314 0.278126 0.296227 0.292508 0.251855 0.236353 0.274503 0.236261 0.239302 0.239557 0.237429 0.228998 0.227800 0.230166 0.230819 0.228151 0.227601 0.229885 0.232718 0.229965
chargesum: 0.00000
title: Mulliken charges with hydrogens summed into heavy atoms:
elementType: S S S N N C C C C C C C C C C C C C C C C C C C C C C C C C
charge: 0.251086 0.246968 0.227420 -0.056256 -0.051531 -0.087052 -0.243973 -0.074520 0.493584 -0.272525 -0.340434 0.475763 -0.194173 0.469245 -0.106904 -0.155621 -0.069065 -0.143422 -0.131438 -0.137386 -0.140950 0.010074 0.009217 0.010408 0.011257 0.006875 0.005070 -0.005274 -0.000117 -0.006326
polarizability: 5.53865144e+02 -3.39374202e+00 3.40976321e+02 8.14544798e+00 5.41831593e+00 2.23266653e+02
1716.lowfreq: -7.2765 -4.2929 -0.0013 0.0010 0.0013 2.1688 7.3614 10.2775 13.9830
frequency: 6.2383 10.0912 13.8086 18.8281 20.9711 23.8847 27.9154 37.1144 49.1585 54.7235 64.3468 77.2126 83.6334 98.3894 115.0315 149.8562 154.9311 162.3224 177.3242 227.3329 248.8262 258.9247 276.7517 320.5958 328.7126 345.1022 354.3065 401.5405 401.6929 402.0852 405.7736 442.8006 460.2492 470.1111 476.1668 489.6274 520.4614 534.8111 548.8716 553.9631 557.0830 616.1009 616.2544 616.7189 627.0543 639.4666 644.1471 701.4687 701.7656 702.4219 718.9022 735.2477 768.4955 774.4543 774.9242 776.0903 809.0664 809.4008 811.1487 851.8684 852.1178 854.3062 854.3304 880.4515 888.5542 898.3431 926.5849 926.6077 930.2024 977.5610 977.7571 979.4516 988.5460 989.4962 989.7904 989.9044 996.9832 997.8567 998.2576 1026.0685 1026.2651 1026.3464 1034.7107 1071.0530 1073.4471 1073.6597 1118.8294 1128.5211 1132.3264 1133.9256 1156.9693 1173.0516 1173.2847 1174.2317 1187.3830 1188.2916 1189.0153 1214.9579 1219.9836 1223.5481 1225.1810 1233.2911 1235.6079 1246.2002 1324.2800 1327.2197 1327.4201 1354.8264 1384.2306 1385.6957 1385.9568 1428.3712 1437.4624 1439.8525 1441.3933 1441.5852 1455.1405 1463.0512 1468.2311 1483.4216 1483.6109 1483.7893 1592.8265 1592.9376 1594.3370 1612.6897 1613.3900 1613.5850 3025.3525 3039.3142 3058.7348 3104.9544 3119.7159 3121.6134 3121.7256 3123.9189 3124.7290 3125.4992 3125.9217 3135.0054 3136.8889 3136.9496 3138.4661 3148.6928 3149.0726 3150.6446 3164.9415 3165.0325 3167.1793 3174.3302
redmass: 6.0305 5.7777 3.8469 4.5780 3.9850 4.1617 5.3689 5.1933 5.2576 5.8313 5.5570 5.5761 6.0604 6.8685 8.0980 7.8530 7.0044 10.5381 6.0493 5.7269 5.8704 6.1870 9.0735 2.2237 2.3009 2.3448 15.9516 2.8106 2.7970 2.8049 10.4996 6.5387 4.5167 8.0839 4.5361 4.9256 9.0943 6.4495 6.2970 6.0098 6.2281 6.2648 6.3353 6.3297 4.7703 4.7644 4.7528 1.6808 1.6990 1.6816 10.0936 7.5606 7.1569 2.1090 2.1301 2.3090 4.0200 3.9854 4.0196 1.2509 1.2520 1.2755 1.3383 1.5349 1.4853 1.4284 1.4473 1.4453 1.4534 1.3908 1.3918 1.3901 9.1042 6.2234 6.2096 6.1580 1.3190 1.3315 1.3261 2.1948 2.2016 2.1971 9.1072 1.4609 1.5111 1.5167 1.0993 1.2567 1.9707 1.5791 3.5457 1.0524 1.0524 1.0520 1.1139 1.1122 1.1134 1.7816 1.9921 2.5105 3.9763 1.4825 1.3758 1.8192 1.2820 1.2740 1.2725 2.2683 8.8306 8.6773 8.5607 4.0602 1.1349 2.1482 2.1918 2.1971 1.1245 1.1568 6.3850 2.3464 2.3294 2.3585 6.0696 6.1050 6.0651 6.0700 6.1148 6.1473 1.0565 1.0572 1.0583 1.1094 1.1061 1.0857 1.0891 1.0858 1.0879 1.0883 1.0882 1.1079 1.0921 1.0921 1.0918 1.0965 1.0964 1.0963 1.1017 1.1017 1.1017 1.0909
irintensity: 0.1807 0.0927 0.0321 0.0573 0.0586 0.1772 0.1886 0.4526 0.1652 1.8773 0.2786 0.2836 0.4411 0.3789 1.5889 2.0825 1.4098 12.9413 4.5165 0.4127 1.7924 7.0789 0.4874 0.9293 0.8868 0.8389 0.7669 0.0999 0.0067 0.0069 7.7435 7.1083 3.3733 3.6243 12.1635 2.7226 4.3794 4.0463 26.0096 39.6030 0.5895 0.2394 0.0761 0.1018 34.1309 24.5799 17.7250 53.4007 64.3212 58.0473 1.3345 2.1981 99.6514 20.3129 53.0248 31.9239 7.7567 9.3274 8.3909 0.1621 0.1081 1.8824 8.5649 0.1985 3.1951 0.0207 3.0769 3.9907 1.7575 0.0132 0.0311 0.0599 18.2415 0.7775 1.2016 0.9911 0.1106 0.0359 0.0778 6.1995 12.9663 4.1234 20.9415 8.3687 5.9101 9.2822 2.8439 18.9972 24.0437 15.4356 155.4163 0.0206 0.0057 0.0346 2.7478 2.8963 1.8928 15.5182 0.6983 5.9289 19.4349 72.1107 27.0345 1.6990 0.2610 0.4137 0.2415 21.6530 0.1102 0.4159 0.3084 19.0506 6.2883 7.8742 8.9289 8.8465 4.0231 22.3742 271.7455 10.7167 19.4213 12.0076 0.8284 1.0054 1.1308 0.5823 3.2936 2.6848 13.3670 11.5878 5.1244 4.9685 0.6494 6.1632 5.1206 7.6363 0.7145 2.0113 0.3341 1.8032 10.4261 18.2499 12.9639 40.1880 30.2462 34.9613 16.3350 40.5810 26.0624 7.5348
temp: 298.150 k
press: 1.00000 atm
elementType: 16 16 16 7 7 6 6 6 6 6 6 6 6 6 6 6 6 6 6 6 6 6 6 6 6 6 6 6 6 6 1 1 1 1 1 1 1 1 1 1 1 1 1 1 1 1 1 1 1 1 1 1
symmnumber: 1
zpe: 1044003.8 jmol-1
zpe.correction: 0.397640 hartree
zpe.thermalcorrener: 0.426136 hartree
zpe.thermalcorrenthalpy: 0.427080 hartree
zpe.thermalcorrgfe: 0.328600 hartree
zpe.sumelectzpe: -2267.401025 hartree
zpe.sumelectthermal: -2267.372529 hartree
zpe.sumelectthermalent: -2267.371584 hartree
zpe.sumelectthermalfe: -2267.470064 hartree
dipole: 2.0458 2.3428 1.0847
dipole: 3.2940
quadrupole: -152.8173 -200.4671 -193.4442
quadrupole: -5.0142 2.9088 8.7085
quadrupole: 29.4255 -18.2242 -11.2013 -5.0142 2.9088 8.7085
hfenergy: -2267.7986647 hartree
pointgroup: C01 [X(C25H22N2S3)]
dipole: 0.9149666 -0.8687458 -0.2960183 debye
polarizability: 549.6325398|28.2525781|343.6499563|-13.121324|-14.4110884|224.8256208 unknown
InChI: InChI=1S/C25H22N2S3/c1-4-10-20(11-5-1)17-28-23-16-26-27-25(30-19-22-14-8-3-9-15-22)24(23)29-18-21-12-6-2-7-13-21/h1-16H,17-19H2
charge 0 multiplicity 1
52 atoms
S  0.364698 -0.781935 0.955489
S  3.051126 0.82289 0.078086
S  -2.533364 0.512658 0.163334
N  -1.134071 2.575026 -0.971556
N  -0.002065 3.273232 -1.315088
C  0.257773 0.806924 0.042685
C  0.004666 -1.995919 -0.526843
C  1.419367 1.526941 -0.322477
C  -0.359595 -3.352774 0.012757
C  4.236626 2.129946 -0.702553
C  -0.999629 1.382021 -0.301638
C  5.656876 1.659314 -0.505989
C  -3.836395 1.680665 -0.651368
C  -5.205052 1.083314 -0.441104
C  -1.691683 -3.628196 0.421654
C  0.619538 -4.373825 0.123183
C  1.225467 2.770329 -0.996416
C  6.298048 0.872604 -1.497721
C  6.37015 1.990401 0.675359
C  -5.974452 1.421832 0.70258
C  -5.747534 0.17122 -1.384058
C  -2.037881 -4.902185 0.920442
C  0.273818 -5.649382 0.623181
C  7.627372 0.431415 -1.316496
C  7.699139 1.549245 0.858748
C  -7.258395 0.865962 0.897195
C  -7.031117 -0.38591 -1.192127
C  -1.056224 -5.916991 1.021738
C  8.331545 0.768876 -0.137182
C  -7.790554 -0.039986 -0.049828
H  -0.822979 -1.52897 -1.083334
H  0.922859 -2.008031 -1.133039
H  4.04505 3.086924 -0.190663
H  3.975322 2.211148 -1.770156
H  -3.70657 2.66251 -0.173729
H  -3.552899 1.765758 -1.71068
H  -2.448713 -2.837952 0.350842
H  1.652195 -4.1671 -0.183529
H  2.057891 3.404397 -1.308602
H  5.753932 0.607248 -2.412217
H  5.881937 2.592683 1.450923
H  -5.564285 2.123204 1.439049
H  -5.160944 -0.098078 -2.270787
H  -3.069145 -5.104603 1.230349
H  1.037842 -6.430941 0.700823
H  8.112792 -0.17138 -2.091891
H  8.240133 1.813895 1.773869
H  -7.842718 1.139515 1.782838
H  -7.439179 -1.084545 -1.931135
H  -1.325687 -6.906025 1.409052
H  9.363206 0.428104 0.004004
H  -8.787439 -0.469769 0.099429
