program: Gaussian 09
title: 000020098
version: EM64L-G09RevD.01
frameworkgroup: C1[X(C9H10O4)]
method: RPBEPBE
basis: SDD
operation: Freq
keyword: #pfreq=noraman
keyword: PBEPBE/SDD
title: #p freq=noraman PBEPBE/SDD
converged: NO YES NO NO
title: Mulliken charges:
elementType: O O O O C C C C C C C C C H H H H H H H H H H
charge: -0.293438 -0.439518 -0.433193 -0.252000 0.307400 -0.509594 -0.550729 0.373446 0.364885 0.192521 -0.525611 -0.220780 -0.675597 0.293320 0.265525 0.250549 0.231191 0.231064 0.214477 0.228707 0.228825 0.359770 0.358782
chargesum: 0.00000
title: Mulliken charges with hydrogens summed into heavy atoms:
elementType: O O O O C C C C C C C C C
charge: -0.293438 -0.079748 -0.074411 -0.252000 0.307400 -0.216274 -0.285204 0.373446 0.364885 0.192521 -0.275063 0.241475 -0.003589
polarizability: 1.62531839e+02 2.08692696e+00 1.27601824e+02 -6.73034790e-02 -2.16923442e-02 5.50510093e+01
1716.lowfreq: -7.2023 0.0007 0.0008 0.0010 2.7083 5.5224 34.1251 66.3917 90.9099
frequency: 33.9721 66.3700 90.9024 94.3053 176.0198 214.9104 220.6943 234.6211 253.5080 275.4222 325.6289 354.6949 368.3330 370.7680 406.6981 498.9978 510.3414 532.2235 558.8140 595.2451 667.9802 732.7523 736.6931 799.1650 818.0620 844.8479 861.1390 907.7401 924.9411 975.1699 981.1641 1025.9211 1080.3781 1112.7776 1125.4866 1136.0828 1145.8580 1181.6873 1195.5315 1250.4957 1276.8647 1328.2104 1362.8649 1402.1961 1415.2074 1459.9601 1464.8115 1473.2654 1486.2165 1491.0106 1602.0729 1624.3171 1632.5451 2995.7856 3011.8071 3070.1844 3092.3127 3107.2681 3147.1315 3157.4017 3185.6217 3583.4811 3588.6254
redmass: 3.4760 3.3799 4.2580 3.3371 3.2733 5.2315 4.1523 3.8747 1.3479 5.6411 4.8117 1.1316 1.1141 5.4525 4.7770 5.4879 5.3871 7.3145 4.9714 4.6329 2.2429 4.1417 9.7079 1.1036 3.6821 1.5479 1.6329 1.5557 5.9712 4.3356 6.2354 2.3690 2.3017 2.2343 1.4688 1.4666 1.3115 1.3156 2.4030 1.1323 1.3679 3.4157 1.6547 1.2776 7.2595 3.4052 1.0402 1.0618 1.1127 2.9117 7.7040 9.0988 6.8882 1.0359 1.0582 1.1065 1.0984 1.1028 1.0925 1.0922 1.0929 1.0661 1.0661
irintensity: 0.2335 1.8016 0.7737 1.5074 0.6023 1.5591 2.0494 1.7207 0.9046 12.0484 9.3384 5.9257 293.4764 16.9259 2.9970 9.1739 6.5729 0.4531 7.4869 1.5221 13.2416 32.9754 9.5397 2.4580 5.0573 15.5692 31.2802 28.8452 127.0341 102.9276 9.8935 91.5768 67.5021 1.8034 216.3037 5.6707 30.7419 86.7826 452.3474 0.0014 64.8731 123.8436 34.0911 20.1501 10.4899 73.3978 12.3286 4.9665 13.0542 1.0423 314.7853 46.2820 55.7182 21.1720 19.2141 6.4698 31.0704 46.7952 3.6740 4.3610 4.1750 43.7226 38.1440
temp: 298.150 k
press: 1.00000 atm
elementType: 8 8 8 8 6 6 6 6 6 6 6 6 6 1 1 1 1 1 1 1 1 1 1
symmnumber: 1
zpe: 458441.9 jmol-1
zpe.correction: 0.174611 hartree
zpe.thermalcorrener: 0.187504 hartree
zpe.thermalcorrenthalpy: 0.188449 hartree
zpe.thermalcorrgfe: 0.134773 hartree
zpe.sumelectzpe: -648.887258 hartree
zpe.sumelectthermal: -648.874365 hartree
zpe.sumelectthermalent: -648.873421 hartree
zpe.sumelectthermalfe: -648.927096 hartree
dipole: 0.6454 3.4424 0.0024
dipole: 3.5024
quadrupole: -55.2208 -80.3611 -77.8085
quadrupole: 5.3556 -0.0259 -0.0396
quadrupole: 15.9093 -9.2310 -6.6784 5.3556 -0.0259 -0.0396
hfenergy: -649.0618691 hartree
pointgroup: C01 [X(C9H10O4)]
dipole: -0.2263772 1.3590349 0.0225306 debye
dipolederiv: -1.681055 0.3380444 0.0398393 0.6114141 -0.6783044 -0.0202178 0.0422847 -0.0131314 -0.278332 -0.170922 -0.294399 -0.01164 -0.363654 -1.3627186 -0.0031186 -0.0122855 -0.0042616 -0.4300132 -0.9309006 0.6744307 0.0222463 0.7347957 -0.6419517 -0.0232723 0.0226421 -0.0211427 -0.4293014 -0.793375 -0.2293361 0.0096789 -0.0369286 -0.9253867 -0.005797 0.0115761 -0.0009443 -0.3183584 -0.4891386 -0.2030286 0.0107524 -0.2266123 0.2627508 0.0095244 0.0109946 0.0088714 0.0264485 -0.3598617 0.3522104 0.009755 -0.133606 -0.1487339 0.0038676 0.0034358 -0.0092593 -0.1761507 -0.2009673 -0.3588757 -0.0053953 0.1379945 -0.4028423 -0.0062474 0.0010005 0.00684 -0.2220786 0.2279982 0.3308216 0.0018645 0.2915682 1.3770681 0.0096387 0.0011675 0.0084398 0.118457 1.0590534 -0.6982899 -0.0351828 -0.6417567 0.6566645 0.0252343 -0.034493 0.0264858 0.1038051 2.0615571 0.0699085 -0.0466271 -0.4094073 1.2921914 0.0224045 -0.0522575 0.010449 0.2249468 -0.1014008 0.1335973 -0.0015035 0.161706 -0.4648172 -0.0077365 -0.0012453 -0.0069987 -0.2270274 1.0380425 -0.1313861 -0.0193202 -0.0267763 0.2497008 -0.0005843 -0.0173083 0.0017214 0.3537662 -0.0821727 0.0937613 0.0044662 0.0734519 -0.0398762 -0.0022623 0.0043749 -0.0028132 0.0639646 0.1417628 -0.0281987 0.0006105 -0.0008641 0.0391665 -0.0019335 0.001002 -0.0012017 0.1793276 0.0987726 0.0717316 0.0031867 0.0822666 0.0008506 -0.0046246 0.0033973 -0.0042518 0.1811766 -0.0697284 -0.026465 0.0065113 -0.0142841 0.0923341 -0.0009635 0.0067417 -0.0006677 0.1878421 -0.0701315 0.02995 0.0045069 -0.0513034 0.004932 -0.0905255 -0.038478 -0.0926682 -0.0581257 -0.0693262 0.0346767 -0.0030467 -0.0468488 0.0019922 0.0942632 0.0383579 0.0924176 -0.0576915 -0.1791621 -0.0269122 0.0074582 -0.0466698 0.0691115 0.0008489 0.0073058 0.0003481 0.1162212 0.115108 -0.0449698 -0.0614934 0.0152216 0.0066863 -0.0952349 -0.0349233 -0.1076798 -0.0639137 0.119699 -0.0400854 0.0515274 0.0195982 0.0041206 0.0950918 0.025812 0.1106601 -0.0656842 0.0823266 0.1022871 0.009911 0.0777267 0.3920471 -0.0019843 0.0094744 -0.0030012 0.3829768 0.2538216 -0.1494731 0.0018946 -0.2070323 0.2150146 0.0036293 0.0014235 0.0017883 0.3877443 unknown
polarizability: 162.3582121|-2.7541847|127.686024|-2.8690201|1.0361664|55.1404365 unknown
InChI: InChI=1S/C9H10O4/c1-2-13-9(12)6-3-7(10)5-8(11)4-6/h3-5,10-11H,2H2,1H3
charge 0 multiplicity 1
23 atoms
O  -2.290247 0.237973 0.131221
O  2.080753 2.828792 0.053405
O  3.404591 -1.842709 -0.046247
O  -1.707879 -2.017576 0.090406
C  0.045675 -0.314571 0.06464
C  1.076575 -1.279504 0.024018
C  0.341475 1.073473 0.075391
C  1.692566 1.478501 0.045382
C  2.419762 -0.844519 -0.006119
C  -1.363469 -0.810267 0.095265
C  2.740525 0.531223 0.004558
C  -3.72793 -0.173126 0.164948
C  -4.5528 1.10885 0.194401
H  0.836012 -2.345374 0.015889
H  -0.478039 1.798525 0.106634
H  3.776218 0.889016 -0.018127
H  -3.932133 -0.789674 -0.728898
H  -3.886945 -0.802163 1.059231
H  -5.629245 0.859309 0.220411
H  -4.315738 1.71116 1.088186
H  -4.361249 1.72234 -0.702558
H  1.288615 3.420335 0.084217
H  4.311608 -1.448214 -0.067055
