program: Gaussian 09
title: 000248114
version: EM64L-G09RevD.01
frameworkgroup: C1[X(C16H19N7O2)]
method: RPBEPBE
basis: SDD
operation: Freq
keyword: #p
keyword: freq=noraman
keyword: PBEPBE/SDD
title: #p freq=noraman PBEPBE/SDD
converged: YES YES NO NO
title: Mulliken charges:
elementType: O O N N N N N N N C C C C C C C C C C C C C C C C H H H H H H H H H H H H H H H H H H H
charge: -0.279424 -0.277283 -0.161349 -0.220346 -0.415088 -0.119964 -0.344561 -0.149603 -0.029299 0.159686 0.119579 0.146196 0.209055 0.134784 -0.617882 -0.600853 0.413891 0.484171 -0.355775 -0.338578 -0.404869 -0.396027 -0.402803 -0.645446 -0.645512 0.354559 0.271758 0.243477 0.243345 0.267234 0.246889 0.246446 0.311086 0.239186 0.240709 0.218438 0.251155 0.210997 0.237294 0.237201 0.220257 0.238880 0.219543 0.238843
chargesum: 0.00000
title: Mulliken charges with hydrogens summed into heavy atoms:
elementType: O O N N N N N N N C C C C C C C C C C C C C C C C
charge: -0.279424 -0.277283 -0.161349 -0.220346 -0.060529 -0.119964 -0.033475 -0.149603 -0.029299 0.159686 0.119579 0.146196 0.209055 0.134784 0.140698 0.159716 0.413891 0.484171 -0.116589 -0.097869 -0.186430 -0.144872 -0.191805 0.049306 0.051755
polarizability: 5.71963645e+02 -1.13044367e+01 2.53695735e+02 -2.09573962e-01 -2.28101339e-01 1.08183715e+02
1716.lowfreq: -9.3358 -1.1458 -0.0014 -0.0004 0.0002 3.8947 19.1241 21.7676 26.2097
frequency: 19.1078 21.5647 26.2071 53.7290 73.3766 86.8930 91.1703 97.7297 99.0656 112.3232 116.9130 127.0688 165.9890 166.4394 181.0479 194.9608 229.7328 235.2154 245.1848 262.1837 276.6243 301.3591 318.6498 345.8222 364.2009 371.7817 379.9554 396.1506 400.4385 426.5855 439.1070 474.5453 484.9466 504.2546 526.5963 543.6365 556.8339 595.5900 635.1351 635.7188 678.8103 687.5097 691.9892 703.0709 716.6562 729.8089 737.9850 765.8451 774.3351 805.7531 827.6321 872.9861 918.9344 923.9870 942.5370 953.7979 962.6430 972.1624 994.6660 997.6763 1036.7165 1054.8331 1077.4077 1104.2064 1106.1706 1110.8540 1129.6831 1131.6474 1135.5737 1166.1973 1195.6804 1197.6400 1223.1665 1227.1049 1254.6023 1258.3675 1261.1817 1291.1397 1305.6833 1326.2697 1364.7884 1372.1175 1382.8676 1397.9587 1415.1812 1428.4338 1429.6409 1449.9667 1459.8356 1464.0891 1469.8268 1472.3549 1476.7703 1478.0242 1478.5201 1482.9463 1492.1811 1502.6047 1506.3988 1531.3814 1548.1763 1564.0843 1584.9170 1605.4821 1633.0814 1641.8446 1661.9563 2944.6918 2952.3199 2982.9311 3004.5153 3009.1190 3011.6840 3016.3195 3092.6603 3100.2218 3101.0770 3110.6362 3115.0743 3134.6297 3136.6622 3146.7479 3166.0078 3172.1458 3446.5159 3607.2001
redmass: 4.4251 4.1031 5.8033 5.0200 2.2579 2.6367 1.1722 1.1504 5.6019 2.3389 2.9707 3.1353 3.7464 3.3806 4.7470 1.1692 4.7325 5.4465 2.6765 4.1779 3.9989 3.1037 6.3475 4.1713 8.4788 4.6384 5.8770 4.0918 6.2430 3.1724 4.8779 4.2252 6.4864 5.4272 2.0585 1.2496 5.0216 5.8600 7.0793 5.4760 1.2564 8.3015 10.5476 10.0400 4.9524 10.9235 3.4318 4.9550 5.5052 1.3227 1.6396 4.5448 1.4169 4.2817 3.0959 1.4438 3.2053 1.3550 2.9935 4.4600 3.3881 1.5088 4.7077 3.5021 1.2368 1.3254 1.3005 1.2992 1.4788 1.6895 2.1516 1.3730 1.8869 2.7123 1.7506 2.8280 6.4250 2.3311 3.3887 1.4691 2.7390 5.0712 4.0168 2.7529 1.3498 1.3622 1.2435 2.7146 1.2763 1.0403 1.4410 1.0495 1.0458 1.1332 1.0480 1.7210 1.1111 2.6056 1.1339 2.7868 6.7215 7.2044 5.8496 8.0009 6.3918 8.1927 9.8758 1.0370 1.0392 1.0871 1.0335 1.0327 1.1002 1.1022 1.1024 1.1021 1.0962 1.0943 1.0894 1.1023 1.1010 1.0875 1.0931 1.0954 1.0761 1.0814
irintensity: 0.2113 0.1944 0.5247 0.5809 0.3722 1.0853 0.3605 1.7176 1.4599 6.0964 2.2629 1.8272 3.5232 3.1580 5.7834 0.3751 1.0047 10.6234 8.9742 13.4275 13.4557 0.7897 3.6880 20.0250 0.0022 10.8631 37.6147 0.5635 41.7996 0.3121 4.9342 2.2145 49.9755 12.5977 3.5210 126.7920 2.8170 1.9662 1.8295 0.0986 109.0285 1.0529 0.1073 1.8920 4.3726 20.1700 1.2362 0.5523 6.1696 12.1206 60.2635 0.9619 24.3570 5.8160 42.8199 12.1773 84.6906 1.1916 2.5574 58.2643 131.8003 28.3928 188.8468 105.5066 0.0057 0.9585 0.3920 0.1394 21.9984 11.4800 42.0972 165.6610 26.1185 9.1848 26.2736 35.0799 38.5446 86.0719 58.4304 21.2754 255.9366 67.0766 24.7702 59.2466 65.6055 36.5982 10.6717 19.7808 55.1911 0.1748 92.5414 18.2437 23.2849 14.0272 17.1474 14.3048 0.7233 588.7274 48.0402 393.0596 5.7371 295.1345 6.0324 1295.7633 468.5868 357.6189 353.5396 105.2627 159.8474 54.3685 41.6853 42.5283 18.9661 63.2616 20.2071 20.2761 4.0563 49.4674 12.6985 0.8321 0.8004 4.5832 26.4028 13.2608 18.8340 48.1472
temp: 298.150 k
press: 1.00000 atm
elementType: 8 8 7 7 7 7 7 7 7 6 6 6 6 6 6 6 6 6 6 6 6 6 6 6 6 1 1 1 1 1 1 1 1 1 1 1 1 1 1 1 1 1 1 1
symmnumber: 1
zpe: 905473.4 jmol-1
zpe.correction: 0.344877 hartree
zpe.thermalcorrener: 0.369053 hartree
zpe.thermalcorrenthalpy: 0.369997 hartree
zpe.thermalcorrgfe: 0.288974 hartree
zpe.sumelectzpe: -1153.011996 hartree
zpe.sumelectthermal: -1152.987819 hartree
zpe.sumelectthermalent: -1152.986875 hartree
zpe.sumelectthermalfe: -1153.067898 hartree
dipole: -10.8273 -2.4261 0.0064
dipole: 11.0958
quadrupole: -120.6044 -136.4642 -150.9947
quadrupole: -12.7372 -0.1468 -0.1358
quadrupole: 15.4167 -0.4431 -14.9736 -12.7372 -0.1468 -0.1358
hfenergy: -1153.3568722 hartree
pointgroup: C01 [X(C16H19N7O2)]
dipole: 4.2943719 0.4832178 0.6178664 debye
polarizability: 568.4822067|16.6339583|124.5725099|-34.3222526|44.0717709|240.7883785 unknown
InChI: InChI=1S/C16H19N7O2/c1-21(2)11-7-5-10(6-8-11)9-17-20-15-18-12-13(19-15)22(3)16(25)23(4)14(12)24/h5-9,18,20H,1-4H3
charge 0 multiplicity 1
44 atoms
O  -3.215657 -1.2699 -2.37165
O  -6.949567 -0.52119 0.427867
N  -4.825269 -0.070497 1.320385
N  -5.080433 -0.88441 -0.94063
N  -1.508516 -0.305349 0.055031
N  -2.486368 0.32817 2.028594
N  -0.073034 0.42164 1.860284
N  7.157247 -0.226619 -1.267104
N  1.037903 0.210294 1.056854
C  -2.89814 -0.454436 -0.115707
C  -3.455845 -0.057769 1.110449
C  -3.662901 -0.899408 -1.240255
C  -5.692578 -0.493002 0.279602
C  -1.319574 0.159199 1.338936
C  -5.390339 0.351742 2.615118
C  -6.009612 -1.319861 -2.007036
C  5.955243 -0.060408 -0.579728
C  3.463651 0.279939 0.833418
C  5.92956 0.399784 0.777387
C  4.694329 -0.344373 -1.208142
C  4.712459 0.562606 1.456096
C  3.489191 -0.177623 -0.517289
C  2.22623 0.46244 1.581102
C  8.43296 0.06898 -0.600847
C  7.154828 -0.700469 -2.65865
H  -0.772905 -0.49761 -0.622975
H  -6.484276 0.266105 2.542317
H  -5.102308 1.394199 2.832201
H  -5.010115 -0.294405 3.42436
H  -5.397845 -1.576298 -2.884609
H  -6.716116 -0.509027 -2.249171
H  -6.591022 -2.194528 -1.671521
H  -0.018581 0.761386 2.82881
H  6.861421 0.630027 1.300565
H  4.66338 -0.69646 -2.242816
H  4.727484 0.916404 2.495301
H  2.539958 -0.400162 -1.015573
H  2.325873 0.827122 2.623158
H  8.587714 -0.570322 0.291817
H  8.491392 1.128044 -0.277584
H  9.263478 -0.11794 -1.299114
H  6.69379 -1.704364 -2.750575
H  8.191551 -0.770412 -3.022773
H  6.605153 -0.00834 -3.327804
