program: Gaussian 09
title: 000248092
version: EM64L-G09RevD.01
frameworkgroup: C1[X(C9H6Cl2N4)]
method: RPBEPBE
basis: SDD
operation: Freq
keyword: #p
keyword: freq=noraman
keyword: PBEPBE/SDD
title: #p freq=noraman PBEPBE/SDD
converged: NO YES NO NO
title: Mulliken charges:
elementType: Cl Cl N N N N C C C C C C C C C H H H H H H
charge: -0.034055 -0.018039 -0.220484 -0.010384 -0.099712 -0.096299 0.538432 -0.289452 -0.331983 -0.292073 -0.206870 -0.212448 -0.094877 -0.127561 -0.144227 0.286736 0.238760 0.287758 0.266876 0.273003 0.286898
chargesum: 0.00000
title: Mulliken charges with hydrogens summed into heavy atoms:
elementType: Cl Cl N N N N C C C C C C C C C
charge: -0.034055 -0.018039 -0.220484 -0.010384 -0.099712 -0.096299 0.538432 -0.289452 -0.045247 -0.053313 0.080888 0.054427 -0.094877 0.145442 0.142672
polarizability: 2.92552869e+02 3.15850275e+00 1.48688769e+02 -1.81580561e-02 1.20151772e-01 5.34502498e+01
1716.lowfreq: -0.0024 -0.0019 0.0011 1.5315 3.6110 6.8001 26.0717 46.2771 62.9888
frequency: 26.0340 46.2760 62.9684 110.7524 155.9429 166.8969 169.4181 199.0753 235.3957 293.4963 361.1750 378.7917 383.8906 450.5713 460.4301 516.5894 552.6763 623.9037 637.0859 641.7353 689.7424 718.0882 746.9542 771.4768 801.9522 840.4418 856.7382 870.0452 874.5806 893.9572 958.7681 986.6997 1016.6157 1024.1517 1082.6613 1119.4757 1139.2107 1171.6078 1219.9815 1229.6547 1264.0237 1286.0781 1347.0678 1369.1011 1389.4374 1404.5293 1424.2803 1462.6215 1548.1342 1580.0069 1593.5512 3073.7190 3162.0613 3182.4824 3186.5814 3256.1705 3265.4243
redmass: 4.6368 9.5166 10.7408 9.1187 4.1228 16.2846 4.6310 9.5593 10.2507 4.7532 7.4855 5.8450 11.6498 7.7771 3.5598 5.6316 4.3006 2.6431 6.8462 7.5511 8.7860 3.8818 1.3640 8.1594 1.5402 1.3574 5.1917 1.4050 6.8610 7.9950 1.5147 1.3795 3.3406 3.7803 2.5481 2.3549 1.4209 1.3496 1.8801 6.3317 2.0698 2.0818 3.9648 2.4710 5.2770 3.4901 3.4173 3.1016 8.4558 6.1536 7.3908 1.0895 1.0889 1.0968 1.0942 1.0977 1.1024
irintensity: 0.0755 2.9274 3.0529 0.5687 1.5017 0.0358 1.6099 3.6176 0.1933 18.4050 18.8689 8.1075 5.0113 14.8757 6.3609 20.8501 4.0486 33.5296 0.7579 0.7921 21.5272 0.2027 6.2093 51.1770 39.0223 33.8472 3.5707 18.9304 11.4149 0.7273 26.3195 5.0142 168.6929 38.8964 65.2085 117.6635 35.8404 7.4461 11.5919 5.5323 2.3340 40.1818 15.8871 0.5129 21.8940 5.2874 197.6297 32.6235 20.4199 20.1250 128.2897 21.5817 0.0639 1.3858 1.0821 2.1309 1.2363
temp: 298.150 k
press: 1.00000 atm
elementType: 17 17 7 7 7 7 6 6 6 6 6 6 6 6 6 1 1 1 1 1 1
symmnumber: 1
zpe: 360561.5 jmol-1
zpe.correction: 0.137331 hartree
zpe.thermalcorrener: 0.150259 hartree
zpe.thermalcorrenthalpy: 0.151204 hartree
zpe.thermalcorrgfe: 0.095348 hartree
zpe.sumelectzpe: -1484.555991 hartree
zpe.sumelectthermal: -1484.543062 hartree
zpe.sumelectthermalent: -1484.542118 hartree
zpe.sumelectthermalfe: -1484.597974 hartree
dipole: -5.5785 -0.3492 0.0022
dipole: 5.5894
quadrupole: -146.9499 -91.9789 -102.4996
quadrupole: 1.1268 -0.0203 0.0279
quadrupole: -33.1404 21.8305 11.3099 1.1268 -0.0203 0.0279
hfenergy: -1484.6933215 hartree
pointgroup: C01 [X(C9H6Cl2N4)]
dipole: 2.1922312 -0.1727064 -0.0047618 debye
dipolederiv: -0.1297868 0.1727715 0.0022381 0.0576025 -0.705466 -0.0081668 0.000677 -0.0082158 -0.0479352 -1.0193928 0.1814272 0.0031669 0.1952706 -0.1507259 -0.0015307 0.003397 -0.0014897 -0.0419174 -1.4114408 -0.1277774 -0.0007323 0.3962974 -0.0555145 0.0003379 0.0048855 0.0003836 0.0302875 0.6613218 0.0905839 0.0014254 -0.6105933 -0.1971975 0.0007871 -0.0044889 0.0000669 -0.1248662 -0.8330035 -0.1277624 0.0008927 -0.3681328 -0.1126078 -0.0006332 0.0065882 0.0008646 -0.2399712 -0.6406517 0.1061954 -0.0010668 0.6319862 -0.1291043 0.0000749 -0.0051394 -0.0001595 -0.2268116 -0.3608234 0.0720188 0.0013059 0.1703042 -0.3395889 -0.0045954 0.0011506 -0.0043662 0.0153112 0.411827 -0.3346133 -0.0047725 0.1125906 1.0905929 0.0142514 0.0012489 0.0146735 -0.0783821 0.1260337 -0.0313753 -0.0004794 -0.2142529 0.0490026 0.0022437 -0.0022758 0.0019112 -0.1011225 0.676433 0.0317016 -0.0011172 -0.2877701 0.1797621 0.0019278 -0.0047886 0.0015352 -0.0179365 -0.4688804 0.2545373 0.0035444 0.3637673 -0.3527233 -0.0042312 0.004887 -0.0040465 -0.0462697 -0.5558439 -0.0486152 -0.0001365 -0.1313502 0.0080431 0.0014895 -0.0012867 0.0012712 -0.1026316 1.4395721 -0.2349892 -0.004282 -0.2720985 0.3414485 0.0052009 -0.0048006 0.0052112 -0.0615511 0.5938742 -0.0837006 -0.0003095 -0.7193234 0.0158494 -0.0005775 -0.0068241 -0.0010593 -0.0251863 1.0511874 0.1048809 -0.0002422 0.589196 0.1486636 0.0007341 0.00414 -0.0001016 -0.0282142 0.0749684 -0.0545804 -0.0006699 -0.0429188 0.0391617 -0.0014171 -0.0005149 -0.0012584 0.1537182 0.0497297 0.0423708 0.0005503 0.1222359 -0.0317534 -0.0022454 0.0025687 -0.0017395 0.191674 0.0633257 -0.0337137 -0.0003075 -0.0384527 0.062637 -0.0012866 -0.0003892 -0.0012613 0.1731279 0.0672407 0.0434587 0.0006266 0.0476874 -0.00398 -0.0021556 0.0005575 -0.0021674 0.1685597 0.0811822 -0.0917581 0.0000584 -0.0486542 0.0726634 0.0000439 0.0002558 0.0000452 0.2064893 0.1231275 0.0689394 0.0003071 0.0466089 0.0708374 -0.0002515 0.0001522 -0.0000973 0.2036277 unknown
polarizability: 292.4134251|-5.4728476|148.8195112|-0.3007382|0.905439|53.4589517 unknown
InChI: InChI=1S/C9H6Cl2N4/c10-8-2-1-7(9(11)3-8)4-14-15-5-12-13-6-15/h1-6H
charge 0 multiplicity 1
21 atoms
Cl 1.470856 2.884262 0.036724
Cl 5.509873 -0.886266 -0.012985
N  -2.697213 -0.271885 0.003165
N  -1.333324 -0.583332 0.000427
N  -4.740386 0.679576 0.00465
N  -4.901378 -0.758072 0.006166
C  0.970935 0.101444 0.003451
C  1.957869 1.124226 0.014695
C  1.433068 -1.248378 -0.01365
C  -0.464406 0.406684 0.009336
C  3.337144 0.846192 0.010103
C  2.801794 -1.560794 -0.018734
C  3.738252 -0.50337 -0.006629
C  -3.42112 0.934275 0.005895
C  -3.667273 -1.281632 0.001676
H  0.679829 -2.041511 -0.022665
H  -0.745769 1.471007 0.019557
H  4.071686 1.654633 0.019205
H  3.140798 -2.599851 -0.031659
H  -2.98497 1.92843 0.005582
H  -3.409962 -2.336336 -0.000111
