program: Gaussian 09
title: 000248097
version: EM64L-G09RevD.01
frameworkgroup: C1[X(C11H16N2O2)]
method: RPBEPBE
basis: SDD
operation: Freq
keyword: #p
keyword: freq=noraman
keyword: PBEPBE/SDD
title: #p freq=noraman PBEPBE/SDD
converged: YES YES NO NO
title: Mulliken charges:
elementType: O O N N C C C C C C C C C C C H H H H H H H H H H H H H H H H
charge: -0.320874 -0.293255 -0.356427 -0.366850 -0.489288 -0.253184 0.181291 0.437027 -0.202846 -0.406892 -0.361517 -0.677665 -0.198479 -0.202854 -0.269929 0.235608 0.250072 0.206498 0.211641 0.202836 0.194177 0.372752 0.313685 0.225825 0.226925 0.213459 0.229196 0.234197 0.222121 0.217509 0.225238
chargesum: 0.00000
title: Mulliken charges with hydrogens summed into heavy atoms:
elementType: O O N N C C C C C C C C C C C
charge: -0.320874 -0.293255 0.016326 -0.053165 -0.003607 0.164955 0.181291 0.437027 0.194168 -0.181067 -0.134592 -0.000812 0.023643 0.014655 -0.044691
polarizability: 1.87542634e+02 -1.74461116e+01 1.51400345e+02 -4.00256306e+00 -1.47567785e+01 9.39621157e+01
1716.lowfreq: -8.1547 -1.0183 0.0007 0.0007 0.0009 6.8030 14.2985 38.5982 41.2225
frequency: 13.2266 38.4415 41.1755 57.1096 74.0235 79.6709 150.9901 175.7612 200.9133 205.8309 239.0695 252.1917 274.3021 312.6959 401.0956 406.8975 425.9583 470.3551 499.9486 516.2400 586.5881 612.8767 629.8916 656.8785 691.0674 746.0251 753.9910 784.1263 814.9327 815.3374 825.2560 876.4730 905.0385 911.9150 956.1550 973.1642 976.3718 980.4235 1023.0776 1024.5129 1054.8331 1074.8255 1083.5370 1114.0595 1139.2089 1152.9248 1169.9819 1184.7586 1192.6158 1229.8094 1252.4408 1274.8596 1291.4335 1322.4165 1329.0735 1336.5488 1384.2669 1391.4459 1403.6645 1431.0339 1436.3572 1462.2971 1466.7054 1473.1901 1480.6921 1485.4978 1494.8495 1531.7963 1588.0516 1607.2001 1623.6931 2934.7359 2945.8406 2988.3609 2994.1955 2994.6296 3012.3582 3081.2973 3092.0507 3101.3124 3119.5850 3124.6339 3140.7238 3150.3741 3166.9028 3351.5712 3473.7186
redmass: 3.9005 4.3022 3.5786 2.5876 3.8958 2.8927 3.2452 3.6781 4.0523 2.8138 1.2567 3.7148 3.2565 5.0438 3.4717 2.9081 3.3531 1.9804 2.9495 2.7791 4.9979 5.7807 3.2110 4.0111 1.9146 1.1774 1.6342 2.3200 1.2866 1.3780 2.1939 1.4953 2.2357 3.2602 1.3684 2.9131 1.3671 5.6095 2.1548 2.1679 3.0433 2.9751 1.6468 2.0827 1.4376 3.3710 1.0532 1.1095 1.1724 1.4235 1.1582 1.7834 2.3145 1.4455 1.5212 1.2325 4.4000 1.2809 1.3846 1.5301 1.3717 1.0706 1.4316 1.1841 1.1072 2.0581 1.1516 1.7615 6.1433 4.9714 6.3576 1.0561 1.0562 1.1057 1.0891 1.0380 1.0801 1.0965 1.0994 1.1008 1.0855 1.0869 1.0926 1.0947 1.1011 1.0846 1.0753
irintensity: 0.1852 1.1989 0.3509 2.9309 4.3122 0.5382 8.5430 3.8365 8.9702 2.3199 2.1078 7.7135 5.1030 0.9626 8.4118 0.5188 12.4753 106.6996 10.4429 25.1521 1.6719 3.4023 33.6732 6.8498 39.1684 137.2687 72.7402 20.4008 3.3254 1.1832 8.5762 7.3387 21.5481 5.8612 0.4397 18.6268 3.6504 2.6486 6.4624 10.6582 82.3369 56.5654 2.5473 17.6060 4.2896 25.4419 1.1977 10.0027 6.9901 39.7796 0.5937 10.2543 38.8710 17.9830 2.0272 28.1715 53.3140 14.5235 11.6060 66.7086 2.1839 28.1378 52.9335 31.2489 0.8029 133.1681 34.2440 27.9033 127.9402 216.5441 103.2347 31.2933 93.5969 67.7102 13.6475 14.8553 49.7793 8.5154 40.3349 31.2718 10.9574 1.5203 21.0025 45.9902 17.1860 270.6084 64.8826
temp: 298.150 k
press: 1.00000 atm
elementType: 8 8 7 7 6 6 6 6 6 6 6 6 6 6 6 1 1 1 1 1 1 1 1 1 1 1 1 1 1 1 1
symmnumber: 1
zpe: 672997.3 jmol-1
zpe.correction: 0.256331 hartree
zpe.thermalcorrener: 0.271912 hartree
zpe.thermalcorrenthalpy: 0.272856 hartree
zpe.thermalcorrgfe: 0.210664 hartree
zpe.sumelectzpe: -687.550899 hartree
zpe.sumelectthermal: -687.535318 hartree
zpe.sumelectthermalent: -687.534374 hartree
zpe.sumelectthermalfe: -687.596566 hartree
dipole: 3.2510 3.8897 -0.6327
dipole: 5.1087
quadrupole: -74.4682 -96.0860 -90.9496
quadrupole: 5.6853 -4.9745 -5.7348
quadrupole: 12.6998 -8.9181 -3.7817 5.6853 -4.9745 -5.7348
hfenergy: -687.80723 hartree
pointgroup: C01 [X(C11H16N2O2)]
dipole: -1.5706694 -1.2504447 -0.0958837 debye
polarizability: 179.7255184|-20.4294915|157.2110335|-6.8685194|20.5410485|95.9685432 unknown
InChI: InChI=1S/C11H16N2O2/c1-2-15-9-8-11(14)13-12-10-6-4-3-5-7-10/h3-7,12-13H,2,8-9H2,1H3
charge 0 multiplicity 1
31 atoms
O  -2.921883 -0.04157 0.668624
O  -0.342231 3.395931 0.092837
N  -0.464384 1.123896 0.559458
N  0.920322 1.053965 0.801359
C  -2.572753 2.333437 0.189498
C  -3.224646 1.03326 -0.300811
C  -1.040131 2.341984 0.247941
C  1.712361 0.109356 0.108419
C  -3.555685 -1.327561 0.31836
C  3.128769 0.19307 0.232259
C  1.141803 -0.952656 -0.645193
C  -3.137308 -2.358517 1.365257
C  3.950586 -0.764884 -0.391262
C  1.980486 -1.908259 -1.26018
C  3.386205 -1.827196 -1.140202
H  -2.863122 3.161116 -0.480794
H  -2.965047 2.58055 1.195129
H  -4.325248 1.163315 -0.367388
H  -2.840845 0.747046 -1.304037
H  -4.658349 -1.192366 0.306328
H  -3.233165 -1.633984 -0.700932
H  -1.073596 0.344781 0.858331
H  1.309372 1.992906 0.951959
H  3.574779 1.006007 0.818224
H  0.055402 -1.015165 -0.766874
H  -3.612126 -3.33305 1.151238
H  -2.042222 -2.500235 1.364567
H  -3.445655 -2.034078 2.373755
H  5.039005 -0.682791 -0.291359
H  1.528234 -2.719379 -1.843128
H  4.029773 -2.571329 -1.620583
