program: Gaussian 09
title: 000248048
version: EM64L-G09RevD.01
frameworkgroup: C1[X(C5H3ClN2O3)]
method: RPBEPBE
basis: SDD
operation: Freq
keyword: #p
keyword: freq=noraman
keyword: PBEPBE/SDD
title: #p freq=noraman PBEPBE/SDD
converged: NO NO NO NO
title: Mulliken charges:
elementType: Cl O O O N N C C C C C H H H
charge: -0.008603 -0.200756 -0.224582 -0.157353 -0.353229 0.032195 0.224022 0.130461 -0.144983 -0.081417 -0.184006 0.320832 0.359705 0.287713
chargesum: 0.00000
title: Mulliken charges with hydrogens summed into heavy atoms:
elementType: Cl O O O N N C C C C C
charge: -0.008603 -0.200756 -0.224582 -0.157353 0.006476 0.032195 0.224022 0.130461 0.175848 -0.081417 0.103707
polarizability: 1.39368890e+02 2.37680013e+00 1.06525978e+02 -5.33345546e-03 -4.23148824e-03 3.30282138e+01
1716.lowfreq: -9.9753 0.0009 0.0017 0.0020 7.8407 11.5628 30.6134 83.8916 149.1702
frequency: 26.4501 83.8550 149.1613 167.5578 270.2171 297.1548 354.9046 374.1095 395.8436 406.0097 504.7010 540.5676 619.4546 658.7916 677.6632 735.3191 759.7625 779.9300 858.6758 895.9833 960.6268 1011.5753 1083.2688 1130.3591 1179.6220 1226.2952 1299.1533 1353.1679 1396.2343 1421.3623 1532.4277 1587.9221 1667.3853 3164.7743 3183.5788 3493.5478
redmass: 15.9117 8.0812 6.9826 16.5170 11.6658 8.0469 19.1542 9.1113 12.5668 4.0255 3.0016 6.1530 8.2186 6.1224 11.6407 2.6720 7.7159 2.0426 8.5541 1.4108 1.3751 4.9361 1.9595 5.5094 8.1396 1.5300 1.7720 8.1018 3.6441 2.5849 7.6377 4.3689 7.6690 1.0920 1.0958 1.0783
irintensity: 0.2250 6.9518 0.7908 1.1625 1.7711 0.8845 0.8605 0.6394 1.3041 0.1409 46.2222 5.6874 6.2584 2.9908 50.7505 6.6034 9.8237 110.0132 15.9086 4.2292 11.9621 8.2762 9.3649 27.0146 376.8218 57.9805 6.0266 52.7310 24.8917 20.3221 98.3374 149.2098 314.1283 9.4474 0.5194 84.8571
temp: 298.150 k
press: 1.00000 atm
elementType: 17 8 8 8 7 7 6 6 6 6 6 1 1 1
symmnumber: 1
zpe: 216807.7 jmol-1
zpe.correction: 0.082578 hartree
zpe.thermalcorrener: 0.091926 hartree
zpe.thermalcorrenthalpy: 0.092870 hartree
zpe.thermalcorrgfe: 0.046151 hartree
zpe.sumelectzpe: -986.679195 hartree
zpe.sumelectthermal: -986.669847 hartree
zpe.sumelectthermalent: -986.668903 hartree
zpe.sumelectthermalfe: -986.715621 hartree
dipole: -6.5635 3.4761 0.0026
dipole: 7.4271
quadrupole: -85.7384 -65.9935 -68.4070
quadrupole: -5.4630 0.0113 -0.0130
quadrupole: -12.3588 7.3862 4.9726 -5.4630 0.0113 -0.0130
hfenergy: -986.7617726 hartree
pointgroup: C01 [X(C5H3Cl1N2O3)]
dipole: 2.7699351 0.9305274 -0.0011795 debye
dipolederiv: -0.5107066 0.2468833 -0.0000766 0.3008044 -0.2201065 0.0000446 -0.0000766 0.0001656 -0.0208378 -0.699326 0.4247183 -0.0003028 0.5267241 -0.8336505 0.0002491 -0.0001535 0.0003265 -0.3295826 -0.4990513 -0.1046146 0.0002568 -0.2148236 -0.8960629 -0.0007292 0.0006297 0.0015789 -0.2423785 -0.7847878 0.0742702 -0.0004438 0.0393969 -0.3625181 0.0005504 0.00116 -0.0005253 -0.1888568 -0.3967328 0.7557088 -0.0001651 -0.2068798 -0.4424594 -0.0000265 0.0001577 0.0004112 -0.2740394 1.5745387 0.4063771 -0.0003636 0.4517531 1.234887 -0.0000395 -0.0007317 -0.0006277 0.1850622 -0.8759072 -0.3742811 0.0003934 0.2922484 -0.3971149 0.0003128 -0.0005944 -0.0002692 0.0075048 1.0525983 -0.7089095 0.0005889 -0.6137441 0.8719916 -0.0003507 -0.0000341 -0.0003434 0.2413594 0.6265479 0.3497804 0.0001099 -0.001337 -0.0280906 0.0001871 -0.0002409 -0.0001441 0.0368433 0.3523433 -0.6823351 0.0001609 -1.1127761 -0.1151476 -0.000177 -0.0000082 -0.0003429 -0.1564735 -0.2067509 -0.4201102 -0.0000142 0.5010818 0.7254184 0.0000465 -0.0000346 -0.0001032 0.0548467 0.1752783 -0.0141229 -0.0000373 0.0277448 0.0982178 -0.000047 0.0000836 -0.000019 0.1678509 0.1562469 0.0640341 -0.0000467 0.0267917 0.2686889 -0.0000121 -0.0000479 -0.0000356 0.3330955 0.0357091 -0.0173989 -0.0000598 -0.0169846 0.0959468 -0.0000085 -0.0001091 -0.0000716 0.1856059 unknown
polarizability: 137.7433141|-7.509683|108.1515524|-0.0007789|-0.0110933|33.028215 unknown
InChI: InChI=1S/C5H3ClN2O3/c6-3-1-4(8(10)11)5(9)7-2-3/h1-2,7H
charge 0 multiplicity 1
14 atoms
Cl 3.405344 -1.419475 0.000493
O  -1.387172 2.148715 -0.000953
O  -1.780487 -2.188874 0.001176
O  -2.897444 -0.191983 0.001444
N  0.907447 1.762653 -0.000018
N  -1.816125 -0.888982 -0.001501
C  -0.512741 -0.180327 -0.000818
C  -0.465814 1.29206 -0.000535
C  0.631765 -0.977596 -0.000491
C  1.920298 -0.386738 0.000084
C  2.043331 0.998354 0.000305
H  0.498729 -2.064485 -0.000735
H  0.973689 2.78775 0.000121
H  3.009079 1.509727 0.000729
