program: Gaussian 09
title: 000248066
version: EM64L-G09RevD.01
frameworkgroup: C1[X(C11H12Cl2FNO)]
method: RPBEPBE
basis: SDD
operation: Freq
keyword: #p
keyword: freq=noraman
keyword: PBEPBE/SDD
title: #p freq=noraman PBEPBE/SDD
converged: YES YES NO NO
title: Mulliken charges:
elementType: Cl Cl F O N C C C C C C C C C C C H H H H H H H H H H H H
charge: -0.054834 -0.044418 -0.197093 -0.254978 -0.156435 -0.315426 -0.376570 0.127938 0.298121 -0.585694 -0.564958 -0.343545 -0.339033 -0.361616 -0.367917 0.330974 0.230030 0.280045 0.248279 0.277458 0.259322 0.306391 0.271777 0.276227 0.269970 0.258490 0.263882 0.263615
chargesum: 0.00000
title: Mulliken charges with hydrogens summed into heavy atoms:
elementType: Cl Cl F O N C C C C C C C C C C C
charge: -0.054834 -0.044418 -0.197093 -0.254978 -0.156435 0.194649 0.149166 0.127938 0.298121 -0.019980 -0.016954 -0.073576 -0.080544 -0.097733 -0.104302 0.330974
polarizability: 1.99579054e+02 1.60617478e+00 1.23243559e+02 -3.68734995e+00 -1.38627339e+01 1.20145572e+02
1716.lowfreq: -9.3653 -7.2491 0.0011 0.0021 0.0022 4.6415 19.0908 31.2386 34.8832
frequency: 18.8013 31.1981 34.8593 59.8295 68.7868 79.4202 91.1573 99.9365 160.0178 202.9518 214.0429 229.8661 256.8714 299.9851 333.4920 378.5145 396.5965 417.0169 441.9628 487.8804 553.5345 569.3985 621.6796 660.3451 688.8580 705.6190 714.5754 750.9014 777.3393 783.5949 798.0771 824.7661 844.8974 913.0722 954.5096 966.2119 997.9641 1005.3090 1021.1116 1039.5295 1057.3436 1101.2143 1105.7556 1118.7180 1158.7233 1199.6064 1208.0842 1231.0236 1258.3860 1261.6698 1280.7987 1292.0109 1304.8201 1351.5320 1355.8198 1369.8721 1388.7134 1404.4236 1449.7299 1454.5875 1460.5109 1478.9816 1492.9402 1555.7473 1596.3874 1608.1564 3028.5686 3033.6606 3059.2085 3064.8649 3096.5104 3114.3693 3140.9019 3146.7323 3156.1584 3158.4417 3178.0425 3182.6455
redmass: 7.5064 7.1789 10.8784 5.0929 2.5543 5.2181 5.2196 3.2881 6.7050 9.7937 4.6726 4.6450 7.3829 7.1305 4.0374 5.4331 3.3597 3.0348 7.4441 4.1172 3.4073 6.7729 7.0458 6.3875 5.8823 5.6862 4.2449 4.0272 1.1906 1.2118 5.9843 1.2445 1.6918 4.0587 1.3394 1.3596 1.5725 2.5988 1.5598 4.5823 4.0905 1.7167 1.3309 1.4899 1.4295 1.9582 2.7022 2.1372 1.1595 1.2282 1.4038 1.2916 1.2657 1.2806 1.3400 5.4439 1.9881 3.7921 1.0983 1.0919 1.1039 1.1857 2.4427 7.6255 7.7889 6.4052 1.0609 1.0637 1.0565 1.0569 1.1053 1.0996 1.0901 1.1112 1.1120 1.0895 1.0957 1.0972
irintensity: 0.0863 0.3356 0.3695 0.6324 0.4980 5.2163 4.3479 3.5281 1.1442 1.2118 3.4640 4.4786 2.9075 0.7451 22.6838 3.4621 3.0762 2.2654 5.4052 19.1505 9.0621 33.0863 0.8331 17.6420 35.7141 37.5643 32.7249 21.1619 14.0293 3.4854 11.5341 2.6802 77.5462 5.6359 0.2956 2.0133 19.2626 14.0305 9.4755 4.5160 2.3309 55.1432 10.3731 27.0795 49.3251 21.7972 43.3197 28.4752 10.7205 42.7675 72.1224 18.7036 25.6122 26.8500 15.6859 1.4024 158.2085 12.2845 17.9491 2.8855 35.2721 28.4000 28.8559 181.2686 28.4755 72.2966 8.3174 15.5843 14.6446 17.3515 3.8078 1.9785 9.0545 14.3506 6.1756 1.0584 1.6195 2.1410
temp: 298.150 k
press: 1.00000 atm
elementType: 17 17 9 8 7 6 6 6 6 6 6 6 6 6 6 6 1 1 1 1 1 1 1 1 1 1 1 1
symmnumber: 1
zpe: 552675.6 jmol-1
zpe.correction: 0.210503 hartree
zpe.thermalcorrener: 0.226849 hartree
zpe.thermalcorrenthalpy: 0.227793 hartree
zpe.thermalcorrgfe: 0.162517 hartree
zpe.sumelectzpe: -1575.121925 hartree
zpe.sumelectthermal: -1575.105579 hartree
zpe.sumelectthermalent: -1575.104635 hartree
zpe.sumelectthermalfe: -1575.169911 hartree
dipole: 0.7718 1.4353 -1.0644
dipole: 1.9464
quadrupole: -126.3310 -125.0543 -100.2315
quadrupole: -6.7932 3.6009 4.2937
quadrupole: -9.1254 -7.8487 16.9741 -6.7932 3.6009 4.2937
hfenergy: -1575.3324282 hartree
pointgroup: C01 [X(C11H12Cl2F1N1O1)]
dipole: 0.3049155 -0.5030801 0.4902746 debye
polarizability: 199.6272737|-1.8111252|119.3789175|3.0081597|-13.7627572|123.9619942 unknown
InChI: InChI=1S/C11H12Cl2FNO/c12-5-7-15(8-6-13)11(16)9-1-3-10(14)4-2-9/h1-4H,5-8H2
charge 0 multiplicity 1
28 atoms
Cl -5.355195 1.374763 0.255153
Cl -0.826565 -4.265631 0.642369
F  4.956858 0.611214 0.488757
O  -1.045181 1.446508 -1.520927
N  -1.542528 -0.230692 0.010153
C  -2.986133 -0.004855 -0.27241
C  -1.1769 -1.492608 0.697153
C  -0.634254 0.605755 -0.658932
C  0.830475 0.522321 -0.314173
C  -3.504482 1.174789 0.564002
C  -1.19013 -2.669806 -0.296096
C  1.767273 0.54956 -1.37959
C  1.298966 0.560348 1.025586
C  3.152978 0.565691 -1.121053
C  2.681857 0.597795 1.303819
C  3.576732 0.585478 0.219813
H  -3.547736 -0.920099 -0.020664
H  -3.126286 0.220255 -1.343417
H  -1.896687 -1.683504 1.512753
H  -0.176424 -1.415501 1.145157
H  -3.397027 1.004704 1.645568
H  -3.040412 2.122498 0.258637
H  -2.170921 -2.818355 -0.771884
H  -0.399625 -2.576774 -1.055523
H  1.3985 0.57585 -2.409602
H  0.586509 0.60336 1.85676
H  3.889488 0.575982 -1.929194
H  3.061249 0.642453 2.328382
