program: Gaussian 09
title: 000248044
version: EM64L-G09RevD.01
frameworkgroup: C1[X(C9H9ClN2)]
method: RPBEPBE
basis: SDD
operation: Freq
keyword: #p
keyword: freq=noraman
keyword: PBEPBE/SDD
title: #p freq=noraman PBEPBE/SDD
converged: YES YES NO NO
title: Mulliken charges:
elementType: Cl N N C C C C C C C C C H H H H H H H H H
charge: -0.076413 -0.204772 -0.077894 0.309248 0.005466 0.318688 -0.365206 -0.652788 -0.327536 -0.762313 -0.217511 -0.229830 0.236363 0.245000 0.265962 0.240856 0.251417 0.276418 0.311316 0.225238 0.228290
chargesum: 0.00000
title: Mulliken charges with hydrogens summed into heavy atoms:
elementType: Cl N N C C C C C C C C C
charge: -0.076413 -0.204772 -0.077894 0.309248 0.005466 0.318688 -0.128843 0.099031 -0.076119 -0.174579 0.007727 -0.001540
polarizability: 1.87801063e+02 -2.85847035e+00 1.14899283e+02 -6.34130811e+00 -3.08111085e+00 6.61208295e+01
1716.lowfreq: -7.1111 0.0013 0.0024 0.0030 6.9048 8.9718 56.0413 69.4245 91.7572
frequency: 55.9298 69.3559 91.7449 142.2723 183.7579 243.4984 271.5585 286.4847 338.6926 438.1446 503.3919 516.7487 564.9185 576.0605 586.4786 668.2386 710.4363 723.9189 757.5612 772.8010 847.0110 858.6340 888.8206 917.3562 941.2491 980.1609 1005.2250 1085.8816 1110.9845 1121.4196 1128.7008 1162.3982 1185.4060 1236.5132 1253.5546 1275.4384 1327.7460 1381.4565 1397.3197 1429.7368 1435.9419 1460.9329 1474.3198 1477.6391 1488.4812 1502.9779 1591.3917 1627.2359 2987.9452 3072.7817 3077.2258 3116.4122 3131.7186 3144.8512 3159.1732 3173.5580 3174.5977
redmass: 1.7208 2.2639 4.3847 3.0294 6.8969 3.1014 2.5152 5.2235 5.7879 3.1089 6.4388 3.9318 5.3912 4.5882 4.8360 5.9694 4.9547 5.9958 1.3952 3.6572 3.9585 1.5117 4.1730 1.8381 1.3761 1.3081 2.0385 2.8386 1.3000 1.3173 1.4374 1.1625 2.0105 2.0959 1.5404 1.8273 2.8123 3.1142 4.5442 1.8045 1.2676 1.7886 1.6718 1.2635 1.5644 2.8689 7.0586 7.6806 1.0359 1.1013 1.0601 1.0995 1.0855 1.0903 1.0959 1.0992 1.1080
irintensity: 0.6567 0.3973 3.9851 4.3115 4.1902 4.6491 1.6100 0.5609 5.0411 13.9984 10.7863 3.3700 9.7421 25.3774 34.6777 18.4773 3.7240 16.8886 96.1708 3.1949 24.1904 0.3586 17.8306 7.6132 2.8622 0.0755 9.8854 2.5262 20.0246 1.8299 6.4278 2.9339 8.5951 2.6663 35.2124 2.4133 13.5512 49.6962 33.9556 5.6351 18.8875 22.3924 27.0361 8.6270 20.2672 0.2280 6.4979 6.5436 47.7584 17.5043 14.5712 2.5601 0.3702 11.2160 23.1102 20.2469 0.5594
temp: 298.150 k
press: 1.00000 atm
elementType: 17 7 7 6 6 6 6 6 6 6 6 6 1 1 1 1 1 1 1 1 1
symmnumber: 1
zpe: 425476.9 jmol-1
zpe.correction: 0.162056 hartree
zpe.thermalcorrener: 0.172611 hartree
zpe.thermalcorrenthalpy: 0.173556 hartree
zpe.thermalcorrgfe: 0.124793 hartree
zpe.sumelectzpe: -917.073300 hartree
zpe.sumelectthermal: -917.062744 hartree
zpe.sumelectthermalent: -917.061800 hartree
zpe.sumelectthermalfe: -917.110563 hartree
dipole: 0.9438 3.4912 1.6009
dipole: 3.9550
quadrupole: -75.2451 -71.9970 -79.2126
quadrupole: -1.8166 -7.1711 0.2888
quadrupole: 0.2398 3.4879 -3.7277 -1.8166 -7.1711 0.2888
hfenergy: -917.2353555 hartree
pointgroup: C01 [X(C9H9Cl1N2)]
dipole: -0.4015309 1.414919 -0.5078852 debye
dipolederiv: -0.8115226 0.0199928 -0.1115138 -0.1072194 -0.2016958 -0.041437 -0.6158396 -0.0100344 -0.3677427 -0.4257786 -0.0312066 0.0762666 -0.2273555 -0.6710321 -0.017156 0.0253592 -0.0889765 -0.1297053 -0.2437675 -0.2355539 -0.0047556 0.0607448 -0.4925552 -0.0202643 -0.0867484 0.0103311 -0.2583503 0.2673887 0.1693912 -0.0684215 0.2128492 -0.1320584 -0.0734464 -0.013022 -0.0530769 0.0697793 0.0690623 0.0749929 -0.0436482 -0.136146 -0.0886211 0.0320082 0.0003966 -0.0178778 0.0355739 -0.3185508 -0.0888686 -0.0080202 -0.0691956 0.7886942 0.048205 0.2130705 0.0811479 -0.0676896 0.0104891 -0.1156329 -0.0252473 -0.0442611 0.05053 0.0206887 -0.04397 0.0521896 -0.1871325 0.1312589 0.1430982 0.0018426 0.1793819 0.4559654 -0.054091 0.0274151 -0.0137748 0.2226603 0.1936062 -0.0388405 -0.0280591 0.0650913 0.1279429 0.0351947 -0.0302991 0.034197 -0.1309697 1.1299515 0.0325066 0.2243785 0.078699 0.1448124 0.0508236 0.546636 0.0237877 0.4800332 -0.0912355 0.0018827 -0.0357051 -0.1695823 0.1346611 0.0473556 -0.0348218 0.0358207 -0.1540645 -0.0598277 0.1070532 -0.0203601 0.2857574 -0.1055582 -0.007945 0.0105858 -0.0075004 -0.1817245 0.0847983 -0.0412536 0.0099439 0.0087883 -0.0959139 -0.0295237 0.0179995 -0.0263584 0.1684592 0.0842093 0.0637743 0.0889209 -0.029215 -0.0132155 -0.0391995 0.0378722 -0.1008363 -0.0323723 -0.054793 -0.0559437 -0.0021582 0.0327384 0.1058129 0.0028847 0.0053859 -0.0026788 0.115225 0.0843576 0.0355703 -0.0594556 -0.0553134 -0.0682441 0.0680289 -0.0191448 0.1249941 -0.0564419 0.0944317 0.0013453 0.0119916 -0.0394656 -0.0627337 -0.0253836 0.0068973 -0.0288472 0.1599973 -0.0555704 -0.0212265 -0.0268688 -0.1052282 0.0307887 0.0951619 -0.0835641 0.0594122 -0.0405898 0.0802 -0.0227215 -0.0542106 0.0509333 0.0143155 -0.0593915 -0.0441303 -0.0404986 0.0441601 -0.0670303 0.0902731 0.0462896 0.0941258 0.0305111 -0.0318322 0.0505133 -0.0318545 0.150478 -0.1016772 -0.0886328 0.0287903 -0.0861272 0.0475936 -0.0006811 0.0294087 0.0004343 0.1604166 unknown
polarizability: 187.7462899|5.3620721|114.1651106|-3.9293389|7.4551377|66.9097744 unknown
InChI: InChI=1S/C9H9ClN2/c1-12-8-5-3-2-4-7(8)11-9(12)6-10/h2-5H,6H2,1H3
charge 0 multiplicity 1
21 atoms
Cl 3.942467 -0.100507 0.854194
N  0.767641 0.87526 -0.183158
N  0.605999 -1.402465 -0.442398
C  -0.585392 0.556533 -0.003781
C  -0.66981 -0.869982 -0.172249
C  1.435575 -0.336759 -0.448222
C  -1.715592 1.351884 0.282176
C  1.344989 2.220283 -0.092195
C  -1.918746 -1.52387 -0.054472
C  2.885327 -0.439637 -0.722502
C  -2.949686 0.678985 0.397957
C  -3.050533 -0.735776 0.232281
H  -1.651398 2.43796 0.40631
H  0.963876 2.731326 0.809233
H  2.439337 2.150053 0.000969
H  1.08875 2.825474 -0.980959
H  -1.988118 -2.608357 -0.181387
H  3.266851 0.297061 -1.443558
H  3.13445 -1.465268 -1.018839
H  -3.854873 1.255145 0.619464
H  -4.030917 -1.213844 0.331836
