program: Gaussian 09
title: 000248131
version: EM64L-G09RevD.01
frameworkgroup: C1[X(C18H21N3O7)]
method: RPBEPBE
basis: SDD
operation: Freq
keyword: #p
keyword: freq=noraman
keyword: PBEPBE/SDD
title: #p freq=noraman PBEPBE/SDD
converged: YES YES NO NO
title: Mulliken charges:
elementType: O O O O O O O N N N C C C C C C C C C C C C C C C C C C H H H H H H H H H H H H H H H H H H H H H
charge: -0.297308 -0.243332 -0.216181 -0.220894 -0.288887 -0.217188 -0.231325 -0.431302 -0.399825 0.009461 0.164646 -0.627440 0.480174 0.096726 0.225001 -0.430258 0.172044 0.245615 -0.531226 -0.313708 0.387674 0.263058 -0.392098 -0.259946 -0.255545 -0.790901 -0.665131 -0.664557 0.267028 0.271591 0.295428 0.350898 0.314734 0.305626 0.239821 0.283534 0.223479 0.271676 0.226011 0.239098 0.220790 0.248343 0.259952 0.228164 0.255360 0.226865 0.218074 0.248011 0.238169
chargesum: 0.00000
title: Mulliken charges with hydrogens summed into heavy atoms:
elementType: O O O O O O O N N N C C C C C C C C C C C C C C C C C C
charge: -0.297308 -0.243332 -0.216181 -0.220894 -0.288887 -0.217188 -0.231325 -0.080403 -0.085091 0.009461 0.164646 -0.088821 0.480174 0.096726 0.225001 -0.134830 0.172044 0.245615 -0.225601 -0.073887 0.387674 0.263058 -0.108565 0.235209 0.209564 -0.061816 0.045259 0.039697
polarizability: 2.91352761e+02 -2.29635202e+01 2.76332108e+02 1.88585676e+01 7.88681762e-01 1.73663019e+02
1716.lowfreq: -6.1632 -3.2615 -2.0791 -0.0006 0.0004 0.0006 17.2300 29.3187 37.9004
frequency: 17.0206 29.3065 37.8946 40.9190 48.9975 55.5406 57.9152 67.7601 69.0686 79.9397 86.6403 95.1282 104.9409 108.6379 112.8376 121.3755 141.6557 166.2701 195.6981 201.5276 207.3961 225.0578 246.6796 279.4012 291.0490 296.2792 306.1643 324.9293 341.4995 349.7713 355.6054 359.4516 421.0035 432.2095 438.4834 445.2097 516.9004 525.8268 541.1257 553.6015 560.0243 570.3736 571.1790 603.5465 617.8866 622.5002 636.4431 672.7036 703.1108 717.0516 738.2338 743.1581 757.2101 763.0212 785.1392 792.7944 809.5018 816.5361 817.7126 822.1359 832.0218 838.3541 882.5180 902.5085 937.8329 947.2716 965.5536 966.1359 996.6646 999.7094 1009.1667 1026.7660 1039.6888 1046.8446 1088.8674 1094.1109 1096.6734 1104.7043 1128.8640 1136.8713 1152.0295 1156.0539 1157.6088 1164.4369 1213.5290 1238.1158 1243.6740 1261.3930 1274.6039 1277.4490 1282.0134 1298.8641 1318.0112 1343.5086 1351.7407 1358.1739 1365.6382 1384.6134 1392.8114 1393.5146 1398.4705 1427.1848 1446.6588 1458.1634 1459.3218 1460.4932 1463.2383 1464.5570 1465.3090 1473.7837 1480.2145 1484.1686 1485.1541 1486.5722 1558.2020 1583.1523 1607.0641 1627.3573 1631.4050 1633.0586 2995.5371 2996.0173 2997.2634 3035.0380 3036.2172 3038.3996 3089.5379 3091.0808 3091.9912 3098.4769 3100.7003 3113.2846 3113.8756 3124.7317 3126.4929 3147.2844 3179.5181 3189.3320 3228.1176 3538.8504 3605.0477
redmass: 5.7616 4.3528 4.7272 4.3269 3.6373 3.9474 3.0071 2.1478 2.2722 7.0962 3.5385 5.0627 6.1844 4.9898 4.4411 4.1988 3.4552 5.0293 1.6837 3.8731 1.5702 3.0424 3.5175 5.5095 2.8199 2.9912 3.8801 2.9457 9.5359 5.2658 5.6903 6.8339 3.3442 3.0091 3.7642 3.8857 4.4937 5.2574 4.3367 1.8124 3.6696 3.3651 2.0142 3.2176 1.8034 4.9453 4.4223 5.1500 5.8241 4.6802 5.0142 3.3283 5.2169 4.8033 3.1283 2.2662 4.2479 1.5842 1.7379 1.6812 2.1827 2.2314 3.1840 5.5415 3.3181 1.4485 3.1339 1.3782 2.0802 2.1687 2.9266 3.5279 1.6844 2.3891 2.0356 2.1483 2.1799 2.6356 2.5694 1.7182 4.0038 1.8266 1.7721 3.1172 8.2506 1.7782 2.3706 1.4706 1.1260 1.7180 1.2612 2.2023 2.0234 1.5822 1.2796 4.1138 1.3630 1.2389 1.2312 1.2345 4.5920 2.3552 1.1156 1.0942 1.1560 1.0654 1.0478 1.0821 1.0896 3.9687 1.8549 1.0598 1.0591 5.8557 6.3088 6.5493 6.5691 7.4790 8.7553 10.1302 1.0362 1.0365 1.0362 1.0598 1.0603 1.0633 1.0987 1.0974 1.0976 1.1028 1.1031 1.0997 1.0996 1.1066 1.1067 1.0907 1.0925 1.0948 1.0995 1.0781 1.0810
irintensity: 2.0409 3.4138 0.9282 3.9220 1.2551 1.5788 0.9707 0.6062 1.9696 4.2211 12.8173 0.1435 1.3218 0.2292 0.3132 1.0127 3.9496 1.8642 0.2995 2.8455 3.6644 0.8234 4.1797 4.0426 5.8883 10.8217 5.8120 3.2730 0.6994 8.7738 2.5285 8.7149 2.4328 12.2995 2.2816 3.5913 20.5337 11.0097 3.7253 51.9279 9.6783 25.0988 39.8511 51.9805 6.4218 43.7289 12.6850 17.9146 27.6462 6.4917 11.1998 2.0749 6.8371 1.1561 15.0931 9.5852 6.0568 4.1971 9.1711 44.7624 10.2972 5.0233 4.0593 1.5381 13.6433 20.8790 8.1280 0.7816 3.9082 24.0809 72.1226 58.4584 13.9454 23.9641 111.7556 83.7154 3.0622 52.9402 230.8291 127.3558 71.2459 41.3368 8.6837 85.4011 441.3286 28.9377 2.4508 30.0466 4.3094 26.1174 12.0335 4.1261 0.9046 12.3307 5.3132 167.2917 14.1024 61.5543 2.6824 51.8746 58.3330 4.3289 70.3707 22.9469 31.5772 16.0217 15.5583 10.3860 49.9815 11.8581 216.7062 29.2503 16.6604 5.8324 3.6167 9.7531 136.9557 48.0091 196.0478 41.8451 17.0521 7.5779 15.8916 29.4805 8.8778 3.9023 12.9107 37.8923 19.2999 1.9251 2.2556 0.0424 10.8724 26.1978 20.9672 10.0192 7.3914 4.1453 0.2766 63.6821 84.1855
temp: 298.150 k
press: 1.00000 atm
elementType: 8 8 8 8 8 8 8 7 7 7 6 6 6 6 6 6 6 6 6 6 6 6 6 6 6 6 6 6 1 1 1 1 1 1 1 1 1 1 1 1 1 1 1 1 1 1 1 1 1
symmnumber: 1
zpe: 987614.3 jmol-1
zpe.correction: 0.376162 hartree
zpe.thermalcorrener: 0.404550 hartree
zpe.thermalcorrenthalpy: 0.405494 hartree
zpe.thermalcorrgfe: 0.314517 hartree
zpe.sumelectzpe: -1387.221545 hartree
zpe.sumelectthermal: -1387.193157 hartree
zpe.sumelectthermalent: -1387.192213 hartree
zpe.sumelectthermalfe: -1387.283191 hartree
dipole: -0.9365 4.6637 2.0267
dipole: 5.1706
quadrupole: -178.0040 -150.2806 -152.7671
quadrupole: 34.3810 11.1166 -2.9359
quadrupole: -17.6534 10.0700 7.5834 34.3810 11.1166 -2.9359
hfenergy: -1387.5977078 hartree
pointgroup: C01 [X(C18H21N3O7)]
dipole: 0.5359951 1.9490593 -0.2283793 debye
polarizability: 298.6566588|15.9016986|263.6531984|16.1003456|26.308702|179.038031 unknown
InChI: InChI=1S/C18H21N3O7/c1-4-27-16(23)18(20-11(3)22,17(24)28-5-2)9-12-10-19-15-7-6-13(21(25)26)8-14(12)15/h6-8,10,19-20H,4-5,9H2,1-3H3
charge 0 multiplicity 1
49 atoms
O  0.195736 -0.435969 -1.832464
O  3.468034 -0.755473 1.104529
O  0.599604 -1.812629 0.003088
O  3.873486 -0.174643 -1.116432
O  3.140734 2.822894 0.222277
O  -5.466687 -0.971673 0.260505
O  -3.474689 -2.016836 -0.111197
N  1.633047 1.54763 -0.999597
N  -1.235751 3.535185 1.798462
N  -4.173355 -0.991697 0.269775
C  1.682481 0.40525 -0.085679
C  1.236681 0.757766 1.387945
C  0.026849 1.650235 1.470786
C  -1.376179 1.326124 1.246871
C  -2.14161 2.535583 1.458815
C  0.065261 3.002789 1.80141
C  0.781974 -0.741786 -0.615468
C  3.1391 -0.184752 -0.106267
C  -2.059123 0.14535 0.879034
C  -3.548647 2.582982 1.31909
C  -3.456979 0.217378 0.715855
C  2.405645 2.675303 -0.805604
C  -4.21153 1.406294 0.941158
C  -0.715762 -1.481656 -2.429324
C  4.798509 -1.447381 1.177091
C  2.335987 3.713879 -1.918193
C  0.096468 -2.561683 -3.14339
C  4.685343 -2.877757 0.645912
H  2.090593 1.263035 1.863117
H  1.077281 -0.2013 1.909744
H  0.933161 3.620839 2.024498
H  1.091262 1.420708 -1.857126
H  -1.475383 4.49958 2.019644
H  -1.546536 -0.808252 0.730124
H  -4.110747 3.506427 1.492388
H  -5.295368 1.376247 0.807147
H  -1.338778 -0.894768 -3.122279
H  -1.339566 -1.895407 -1.618162
H  5.039502 -1.416922 2.251123
H  5.528957 -0.85173 0.602485
H  1.449339 3.598166 -2.565149
H  2.334701 4.722523 -1.474697
H  3.241599 3.627421 -2.545601
H  -0.59697 -3.263852 -3.641851
H  0.70568 -3.135336 -2.425941
H  0.757303 -2.123993 -3.911107
H  5.645608 -3.404909 0.797084
H  4.458129 -2.879775 -0.433102
H  3.895303 -3.433503 1.17877
