program: Gaussian 09
title: 000248029
version: EM64L-G09RevD.01
frameworkgroup: C1[X(C9H7ClN4)]
method: RPBEPBE
basis: SDD
operation: Freq
keyword: #p
keyword: freq=noraman
keyword: PBEPBE/SDD
title: #p freq=noraman PBEPBE/SDD
converged: NO YES NO NO
title: Mulliken charges:
elementType: Cl N N N N C C C C C C C C C H H H H H H H
charge: -0.039064 -0.070783 -0.400590 -0.124381 -0.015431 0.450229 -0.354422 -0.355128 -0.325952 -0.212970 -0.202129 -0.102569 0.133912 -0.296333 0.242119 0.278453 0.263426 0.261270 0.260028 0.344299 0.266015
chargesum: 0.00000
title: Mulliken charges with hydrogens summed into heavy atoms:
elementType: Cl N N N N C C C C C C C C C
charge: -0.039064 -0.070783 -0.056291 -0.124381 -0.015431 0.450229 -0.112303 -0.076675 -0.062526 0.048299 0.057900 -0.102569 0.133912 -0.030318
polarizability: 3.19504250e+02 3.72458183e+00 1.21182445e+02 5.59222157e-03 2.28213457e-03 5.07634158e+01
1716.lowfreq: -4.6904 -0.0016 -0.0011 0.0020 1.9540 3.6741 41.5081 46.4837 62.1178
frequency: 41.4953 46.4574 62.1135 119.3598 170.7653 185.6634 239.5712 312.2418 313.4210 376.0704 413.2567 426.1367 503.3311 505.5592 623.5327 646.6865 647.5610 704.4137 714.0573 732.6170 774.3604 828.4137 844.5253 852.0243 853.3483 921.7734 957.5396 987.1577 989.7114 998.3516 1006.3564 1068.9118 1074.3979 1107.6557 1176.1791 1183.2630 1213.2018 1227.5679 1260.1378 1291.9472 1303.5870 1336.2244 1375.5436 1398.8664 1402.5212 1468.8257 1498.7548 1564.2796 1588.9995 1603.4688 3018.4233 3135.6074 3157.8784 3173.2389 3177.4533 3252.4196 3610.7647
redmass: 5.8005 6.5792 7.5520 9.2310 8.9869 4.2596 9.3620 5.4047 3.6383 7.1799 2.9133 9.0386 5.9045 2.8732 7.1725 4.9896 7.0857 2.3217 1.4996 5.2583 8.6302 1.3259 1.3885 4.6668 1.3508 8.4667 1.3497 1.3553 4.0964 3.8843 1.5946 2.8675 4.3887 1.3539 1.2004 2.0989 3.3700 4.4004 2.4320 1.3423 2.4634 1.9651 4.6507 2.2796 3.7220 2.3544 3.8834 8.0481 6.0462 6.6676 1.0888 1.0900 1.0884 1.0957 1.0977 1.0990 1.0831
irintensity: 2.5944 0.2694 0.2623 1.3975 1.0834 5.4840 1.7140 8.9442 7.6473 1.9505 0.0677 19.1043 12.9451 32.5757 0.7993 3.1692 3.6306 17.1476 113.9268 1.4795 14.7167 24.6862 41.1516 17.7786 27.8822 28.5086 1.2713 0.1223 31.9604 42.9034 23.3914 78.6762 27.9236 11.3922 10.6017 9.8034 49.1869 3.9086 38.1351 7.9714 16.2921 0.6947 16.1588 9.9423 14.2040 4.5839 136.8389 113.0657 128.9566 11.2919 18.3323 6.0000 0.2341 4.3999 3.2540 4.9317 79.4433
temp: 298.150 k
press: 1.00000 atm
elementType: 17 7 7 7 7 6 6 6 6 6 6 6 6 6 1 1 1 1 1 1 1
symmnumber: 1
zpe: 391585.5 jmol-1
zpe.correction: 0.149147 hartree
zpe.thermalcorrener: 0.160610 hartree
zpe.thermalcorrenthalpy: 0.161554 hartree
zpe.thermalcorrgfe: 0.109589 hartree
zpe.sumelectzpe: -1025.220232 hartree
zpe.sumelectthermal: -1025.208769 hartree
zpe.sumelectthermalent: -1025.207825 hartree
zpe.sumelectthermalfe: -1025.259790 hartree
dipole: 1.2379 -0.3387 0.0005
dipole: 1.2834
quadrupole: -103.4738 -76.8602 -90.9302
quadrupole: 3.0917 -0.0040 0.0006
quadrupole: -13.0524 13.5612 -0.5088 3.0917 -0.0040 0.0006
hfenergy: -1025.3693795 hartree
pointgroup: C01 [X(C9H7Cl1N4)]
dipole: 0.4846637 -0.1416351 0.0001793 debye
dipolederiv: -1.1221953 0.1084786 -0.0000197 0.1612669 -0.1345369 0.0000074 -0.0000113 0.0000056 -0.0582303 -0.891623 -0.0402296 -0.0000712 -0.5928176 -0.3603827 0.0000122 0.0000258 -0.0000434 -0.2218547 0.315319 0.2416263 0.0002659 -0.0662037 -0.409601 -0.00004 0.0001375 0.0001395 -0.2118763 -0.4157195 0.0320293 -0.0001236 0.1969994 -0.4547677 -0.0001301 -0.0001203 0.0000657 -0.2161178 -0.8620221 -0.3071633 0.0000274 0.4573813 -0.1167905 0.0001927 0.0001789 -0.000216 -0.175117 -0.5617758 0.0461226 -0.0000173 0.1877915 -0.1046866 0.0000091 -0.0000238 0.000011 -0.0143883 0.2601745 -0.1134297 0.0000102 0.2002119 0.0810336 -0.0000088 -0.0000124 -0.000015 -0.1420419 0.1389807 0.0641742 -0.0000051 -0.2445992 0.0295256 -0.0000159 0.0000126 -0.0000131 -0.1065824 1.2480731 0.0147421 0.0000128 0.0301532 0.3620242 -0.0000103 0.0001905 -0.0000203 -0.0036752 -0.4362928 0.1853346 -0.0000186 0.3743489 -0.0793095 0.0000048 -0.0000233 -0.000003 -0.1011014 -0.5529541 -0.0885843 0.0000005 -0.1978416 0.0259078 -0.0000119 0.0000052 -0.0000083 -0.1025968 1.5012836 -0.1633901 0.0000231 -0.2109346 0.2262448 -0.0000232 0.0000153 -0.0000196 -0.0606601 0.8148848 0.040981 0.0000822 0.065869 0.4928608 -0.0000942 -0.0001985 0.000036 0.132877 0.1029044 -0.0797419 -0.0001392 -0.5931218 0.215124 0.0000796 0.0000862 -0.0001404 -0.0795607 0.057851 0.0867979 -0.0000057 0.0539147 -0.0432718 0.0000144 -0.0000057 0.0000147 0.156665 0.0690403 -0.0749672 0.000003 -0.0459405 0.0313628 0.000007 0.0000047 0.0000072 0.1518162 0.0386139 0.0057623 0.0000017 0.0648191 -0.0938183 0.0000163 0.0000079 0.0000295 0.1835104 0.0157907 -0.0722393 0.0000039 -0.0720142 0.0255946 0.0000096 0.0000047 0.0000101 0.1683337 0.0526955 0.0540616 -0.0000049 0.0625967 -0.014673 0.0000132 -0.0000056 0.0000125 0.1646936 0.222042 0.0091931 -0.000058 0.1134415 0.2539182 -0.0000153 0.0000145 -0.0000063 0.3604727 0.0049292 0.0504418 0.0000327 0.0546792 0.0682418 -0.0000165 -0.0002831 0.0001539 0.1754343 unknown
polarizability: 319.5737039|0.3058037|121.1129918|0.0056307|0.0021854|50.7634158 unknown
InChI: InChI=1S/C9H7ClN4/c10-8-3-1-7(2-4-8)5-11-9-12-6-13-14-9/h1-6,14H
charge 0 multiplicity 1
21 atoms
Cl 5.63889 -0.437017 0.000151
N  -1.256457 -0.42517 0.000119
N  -3.552857 -1.144133 -0.000199
N  -3.26997 1.074217 -0.000342
N  -4.845703 -0.637095 -0.000651
C  1.064925 0.297168 0.000088
C  1.972069 1.393753 0.000014
C  1.583622 -1.030344 0.000182
C  -0.375837 0.557321 0.000062
C  3.36542 1.180195 0.000033
C  2.970925 -1.25798 0.0002
C  3.842899 -0.145798 0.000125
C  -2.611417 -0.127294 0.000073
C  -4.603789 0.713677 0.000363
H  1.584297 2.419362 -0.000058
H  0.877362 -1.865988 0.00024
H  -0.701736 1.614605 -0.000021
H  4.064633 2.020893 -0.000024
H  3.375132 -2.274245 0.000272
H  -3.389951 -2.149504 -0.000371
H  -5.422756 1.428077 0.000245
