program: Gaussian 09
title: 000248025
version: EM64L-G09RevD.01
frameworkgroup: C1[X(C14H10N2OS)]
method: RPBEPBE
basis: SDD
operation: Freq
keyword: #p
keyword: freq=noraman
keyword: PBEPBE/SDD
title: #p freq=noraman PBEPBE/SDD
converged: YES YES NO NO
title: Mulliken charges:
elementType: S O N N C C C C C C C C C C C C C C H H H H H H H H H H
charge: 0.181795 -0.218822 -0.398886 0.058439 0.388565 0.068797 -0.394511 -0.243900 -0.319556 -0.010993 -0.192714 -0.249339 -0.110524 -0.274598 -0.167698 -0.208381 -0.227917 -0.227894 0.327623 0.235022 0.277538 0.235413 0.237458 0.249950 0.286481 0.231312 0.235500 0.231841
chargesum: 0.00000
title: Mulliken charges with hydrogens summed into heavy atoms:
elementType: S O N N C C C C C C C C C C C C C C
charge: 0.181795 -0.218822 -0.071263 0.058439 0.388565 0.068797 -0.159490 -0.243900 -0.042018 -0.010993 0.042699 -0.011881 -0.110524 -0.024648 0.118784 0.022931 0.007583 0.003947
polarizability: 2.97879118e+02 7.30995403e+00 1.91022077e+02 6.01820421e+00 -7.03726633e+00 8.72870487e+01
1716.lowfreq: -4.8447 -2.2455 0.0012 0.0015 0.0017 6.5859 14.6606 21.0174 64.0917
frequency: 13.1594 20.4086 64.0621 69.0908 137.7583 166.9624 169.1529 201.1336 243.4525 258.5484 293.6753 372.5175 398.7690 411.8068 427.5335 467.3212 483.8761 516.9846 522.1429 573.7132 607.0588 609.5571 612.2554 629.5403 674.3642 680.0095 688.7572 726.7626 749.3808 769.5361 791.1567 830.4576 836.0637 877.4359 911.1244 917.3924 967.6095 969.9773 984.1497 991.8832 994.4732 1002.5747 1015.4966 1034.2063 1068.1959 1078.5999 1103.7100 1150.0941 1170.4087 1173.3579 1189.2244 1220.7788 1260.9782 1276.6214 1310.7673 1377.2349 1391.3092 1412.3601 1428.4300 1461.5612 1462.6988 1486.7681 1540.2953 1587.4570 1589.2739 1593.7207 1605.4616 1623.5763 3128.7426 3131.1526 3142.7966 3144.9116 3155.0665 3157.3664 3167.8119 3173.0514 3194.5985 3527.0896
redmass: 4.8425 6.1900 5.3500 5.6207 8.1573 6.5331 5.7688 5.5320 5.9638 4.6522 7.1648 9.9777 3.3723 6.5364 3.4440 5.1315 5.0941 6.7773 3.8793 7.0146 6.4410 1.9288 2.5085 7.3506 6.1742 4.0504 2.2427 6.7817 1.5412 1.7058 2.7972 4.8625 1.3549 1.4912 1.7828 3.3712 1.4088 1.3684 5.3373 6.1060 1.3863 1.3350 3.6772 2.0802 2.3029 1.6041 2.3463 2.4383 1.0941 1.0534 1.1205 3.3261 1.9840 1.7660 1.2973 9.8440 4.8228 2.6470 2.1178 2.1539 2.9331 2.4243 5.3893 6.0964 6.3737 8.5022 7.0607 7.1079 1.0878 1.0851 1.0894 1.0894 1.0946 1.0940 1.1001 1.1003 1.0959 1.0780
irintensity: 2.8749 1.9931 2.5334 0.5710 0.4474 0.0671 2.1209 2.3976 1.8837 2.9252 8.4787 6.4871 0.4762 0.5824 2.2136 3.9608 8.2830 8.2215 13.2960 0.2555 11.8981 32.7092 29.3123 11.2010 11.8715 13.7767 46.2046 0.7781 72.1918 96.2805 11.5653 12.5778 1.1671 0.4868 10.9899 55.3580 0.2800 3.0775 6.9726 3.8082 0.5122 0.4364 34.2783 1.0736 14.0951 6.5648 5.4577 164.8316 7.6800 0.0569 6.3551 163.9614 20.4582 32.2447 2.3155 1.1489 102.4693 52.4558 17.5991 93.0648 46.9297 80.8386 556.5644 24.1485 1.2190 16.0871 153.1193 101.9628 4.2117 0.4154 8.3015 9.3931 21.3053 6.4974 25.9879 24.6147 3.9173 41.1913
temp: 298.150 k
press: 1.00000 atm
elementType: 16 8 7 7 6 6 6 6 6 6 6 6 6 6 6 6 6 6 1 1 1 1 1 1 1 1 1 1
symmnumber: 1
zpe: 539329.0 jmol-1
zpe.correction: 0.205420 hartree
zpe.thermalcorrener: 0.220034 hartree
zpe.thermalcorrenthalpy: 0.220978 hartree
zpe.thermalcorrgfe: 0.160982 hartree
zpe.sumelectzpe: -1121.055516 hartree
zpe.sumelectthermal: -1121.040902 hartree
zpe.sumelectthermalent: -1121.039958 hartree
zpe.sumelectthermalfe: -1121.099954 hartree
dipole: -1.6312 -5.1012 0.9284
dipole: 5.4355
quadrupole: -82.2200 -110.0317 -114.1647
quadrupole: 9.6317 2.5983 -3.2379
quadrupole: 19.9188 -7.8929 -12.0259 9.6317 2.5983 -3.2379
hfenergy: -1121.2609357 hartree
pointgroup: C01 [X(C14H10N2O1S1)]
dipole: 0.7343098 -1.9912001 -0.2627862 debye
polarizability: 295.9773701|-3.8393263|190.9170476|22.5975308|4.620543|89.2938262 unknown
InChI: InChI=1S/C14H10N2OS/c17-13-11-8-4-5-9-12(11)15-14(16-13)18-10-6-2-1-3-7-10/h1-9,15H
charge 0 multiplicity 1
28 atoms
S  -1.45239 -1.841979 0.492562
O  1.092538 2.590104 -0.009429
N  1.20234 -1.502459 0.161035
N  -0.03667 0.544498 0.211342
C  2.44646 -0.845499 0.085144
C  2.443575 0.580116 0.038844
C  3.663339 -1.572068 0.043474
C  0.029332 -0.762362 0.240689
C  3.681503 1.26512 -0.042923
C  1.149706 1.33205 0.067819
C  4.878494 -0.868255 -0.039908
C  4.892845 0.551937 -0.082368
C  -2.857612 -0.815205 -0.132596
C  -3.731601 -1.432126 -1.057098
C  -3.096421 0.491607 0.346144
C  -4.873649 -0.727479 -1.502624
C  -4.231385 1.191367 -0.124127
C  -5.122775 0.58529 -1.039658
H  1.161381 -2.523846 0.125397
H  3.655678 -2.667715 0.079336
H  3.652358 2.359101 -0.077789
H  5.821529 -1.424576 -0.071283
H  5.846062 1.085987 -0.147757
H  -3.521423 -2.441034 -1.42688
H  -2.397166 0.960787 1.040789
H  -5.556357 -1.201597 -2.216078
H  -4.415133 2.21079 0.231309
H  -6.003858 1.132743 -1.392168
