program: Gaussian 09
title: 000248033
version: EM64L-G09RevD.01
frameworkgroup: C1[X(C11H15Cl2N5O2)]
method: RPBEPBE
basis: SDD
operation: Freq
keyword: #p
keyword: freq=noraman
keyword: PBEPBE/SDD
title: #p freq=noraman PBEPBE/SDD
converged: YES YES NO NO
title: Mulliken charges:
elementType: Cl Cl O O N N N N N C C C C C C C C C C C H H H H H H H H H H H H H H H
charge: -0.057746 -0.039017 -0.284017 -0.264228 -0.199128 -0.150762 -0.166570 -0.120481 -0.404248 0.269028 0.148816 0.116973 -0.312672 -0.423971 0.122679 -0.671493 0.164516 -0.598664 -0.545357 -0.615292 0.220000 0.279123 0.242484 0.273106 0.233118 0.305345 0.243840 0.361478 0.300801 0.261535 0.277252 0.270949 0.246976 0.243845 0.271783
chargesum: 0.00000
title: Mulliken charges with hydrogens summed into heavy atoms:
elementType: Cl Cl O O N N N N N C C C C C C C C C C C
charge: -0.057746 -0.039017 -0.284017 -0.264228 -0.199128 -0.150762 -0.166570 -0.120481 -0.042770 0.269028 0.148816 0.116973 0.186451 0.091619 0.122679 0.110810 0.164516 -0.036328 0.002844 0.147312
polarizability: 2.44694697e+02 -3.11552076e+00 1.81606642e+02 -1.23525705e+00 2.95968929e+01 1.26793174e+02
1716.lowfreq: -6.9515 -4.4482 -1.9573 -0.0025 -0.0023 0.0005 14.6985 24.9085 36.4901
frequency: 14.4430 24.7190 36.4084 38.0057 73.1400 79.0278 89.4298 98.5943 105.9788 125.4361 149.9721 176.7323 194.8825 226.5533 237.6589 252.2567 258.8968 284.1839 289.7443 307.8190 351.6869 361.9282 377.0586 398.7074 436.9313 452.5996 501.6232 534.1851 571.9751 608.9265 621.6598 658.2126 678.6590 687.5490 699.5582 704.7767 718.4354 728.0650 753.7290 767.4257 778.8933 872.7542 924.7657 931.6841 982.4276 1015.1755 1018.7723 1058.8223 1065.3274 1110.5248 1114.8851 1125.6826 1132.0110 1156.4205 1174.3859 1188.6136 1203.3348 1222.1258 1258.1923 1269.1360 1275.1053 1288.9833 1303.3901 1324.1818 1349.1478 1354.8033 1362.2766 1366.8708 1396.8143 1420.7646 1440.5051 1450.1731 1450.8310 1456.9113 1463.9649 1476.7867 1478.4392 1479.8091 1504.2839 1508.8670 1530.5021 1587.7660 1641.4419 1660.7917 2982.6963 2999.4454 3006.6261 3020.3510 3053.2553 3068.4955 3075.3096 3084.6729 3096.1944 3102.5923 3107.3234 3136.2236 3138.7528 3159.1169 3534.0877
redmass: 6.9918 8.3768 8.8696 11.3715 2.5850 5.3171 3.8566 1.7686 1.5677 4.9506 4.5628 7.0926 6.2970 5.2296 3.7588 2.1470 2.1649 3.6874 2.2367 3.5822 6.1729 4.9594 7.6566 3.3866 6.1141 4.2539 3.5963 4.4821 5.6139 5.3291 3.4211 5.9400 3.8240 5.2706 7.0255 7.1476 4.2530 5.0545 3.0354 3.1505 1.3576 2.2491 2.6610 2.1905 2.2268 1.6570 3.8558 2.4408 2.8177 2.6957 1.6364 1.3224 1.2974 2.1586 3.0040 2.1122 1.9830 2.4851 1.2740 3.4551 1.6587 4.1611 1.2268 1.3208 2.7908 1.7627 1.5745 1.3135 2.3498 1.2988 1.0953 1.4595 1.0983 1.2776 1.2740 1.1953 1.0454 1.1300 2.0564 1.2553 3.3152 7.1474 8.9780 6.4152 1.0339 1.0691 1.0334 1.0592 1.0576 1.0569 1.1021 1.1042 1.1025 1.1010 1.0944 1.1014 1.1094 1.1122 1.0769
irintensity: 0.2086 1.9665 0.0426 0.6797 4.6612 1.7210 4.3247 0.6398 0.4045 0.6148 2.7696 2.4512 11.9460 1.7526 6.7693 9.1183 0.2050 3.5809 3.4911 3.5379 11.6974 4.6313 7.1362 2.3825 11.5338 16.9368 13.3575 1.2494 26.7705 18.3267 5.7735 23.1272 20.6495 26.4483 7.8410 36.5538 13.9192 4.0330 99.5568 18.1029 3.0839 6.9884 8.9375 24.0061 28.5426 2.0081 10.0667 0.7274 10.1780 97.0474 30.2030 6.2063 0.2155 30.3320 10.5532 11.1474 35.9696 20.9327 19.3046 21.9776 26.4075 11.9679 5.1011 22.7864 48.6717 10.5809 29.4822 40.1821 35.0443 9.6094 13.0720 170.2587 8.0160 120.3306 2.4768 62.9866 15.8644 13.1714 123.5367 92.4723 421.6907 87.4949 541.0547 679.2317 50.6023 23.7371 30.1913 29.9591 31.0349 15.5880 15.6493 7.7732 18.7036 0.9685 2.5433 0.5568 14.8691 7.6645 78.4954
temp: 298.150 k
press: 1.00000 atm
elementType: 17 17 8 8 7 7 7 7 7 6 6 6 6 6 6 6 6 6 6 6 1 1 1 1 1 1 1 1 1 1 1 1 1 1 1
symmnumber: 1
zpe: 702327.9 jmol-1
zpe.correction: 0.267503 hartree
zpe.thermalcorrener: 0.287951 hartree
zpe.thermalcorrenthalpy: 0.288895 hartree
zpe.thermalcorrgfe: 0.214950 hartree
zpe.sumelectzpe: -1771.030427 hartree
zpe.sumelectthermal: -1771.009979 hartree
zpe.sumelectthermalent: -1771.009035 hartree
zpe.sumelectthermalfe: -1771.082979 hartree
dipole: -6.8832 -2.9574 -1.2835
dipole: 7.6008
quadrupole: -146.5062 -139.1224 -132.4742
quadrupole: 14.7060 1.8895 2.1316
quadrupole: -7.1386 0.2452 6.8934 14.7060 1.8895 2.1316
hfenergy: -1771.2979294 hartree
pointgroup: C01 [X(C11H15Cl2N5O2)]
dipole: -2.8753811 0.7191129 -0.3968839 debye
polarizability: 241.6215405|2.6547237|159.0748305|-14.0207228|-41.1653511|152.3981425 unknown
InChI: InChI=1S/C11H15Cl2N5O2/c1-16-7-8(17(2)11(20)15-9(7)19)14-10(16)18(5-3-12)6-4-13/h15H,3-6H2,1-2H3
charge 0 multiplicity 1
35 atoms
Cl -3.69748 -1.270526 3.575769
Cl -1.972459 -0.636851 -3.227598
O  2.674705 2.395203 -1.530864
O  4.506214 -1.324566 0.667169
N  -0.152962 1.222978 -0.697299
N  -2.374645 0.335716 -0.01157
N  2.155507 -1.147431 0.671734
N  -0.267806 -0.72482 0.511088
N  3.505318 0.49779 -0.408078
C  -0.982555 0.276564 -0.098102
C  1.170969 0.771367 -0.491319
C  1.052468 -0.409049 0.259989
C  -2.995041 -0.609019 0.959182
C  -3.233076 0.779099 -1.129072
C  2.437306 1.32795 -0.87911
C  -0.486607 2.483207 -1.381064
C  3.457535 -0.704211 0.334794
C  -2.819427 -0.089613 2.393067
C  -3.515578 -0.291124 -2.196995
C  1.983042 -2.395899 1.437612
H  -4.071525 -0.685345 0.726781
H  -2.541786 -1.612441 0.8750
H  -4.207098 1.085869 -0.699414
H  -2.810631 1.669725 -1.61664
H  -1.20002 3.070077 -0.776621
H  0.448174 3.052752 -1.505126
H  -0.905837 2.291633 -2.385363
H  4.451508 0.814025 -0.641139
H  -1.764152 -0.087778 2.698046
H  -3.285556 0.894709 2.544742
H  -3.806531 -1.2596 -1.763875
H  -4.275871 0.056177 -2.914149
H  1.382333 -3.116095 0.857357
H  1.465846 -2.190993 2.389957
H  2.985019 -2.805981 1.631813
